{"text_format":"1","workbook":"xlsx","n_sheets":5,"sheets":["Calculator","Kammar","Drivare","Slangar","Blad1"],"not_rendered":{"charts":0,"images":11,"macros":1,"external_links":0,"defined_names":78,"comments":0,"pivot_tables":0},"unopened":[],"bounds":{"document_bytes":16777216,"sheet_cells":100000,"rows_first":2000,"rows_last":500,"rows_between":2000,"halvings":0,"cell_chars":16384,"cell_head_chars":4096},"cells_cut":0,"cells_raw":0,"read":"whole","date_system":"1900"}

{"sheet":"Calculator","index":0,"n_rows":85,"n_cols":32,"rows_kept":85,"cut":false,"hidden":false,"merged":[]}
[null,null,null,null,null,"List_Box_2","List_Box_3","List_Box_4"]
[null,"Index 2","Index 3","Index 4",null,"Standard",15,10]
[null,1,1,1,null,"With Gas Hose Connection (-H)",40,24]
[null,null,null,null,null,null,60,49]
["Skriv i dessa manuellt för List_box_1",null,null,"Index 1",null,null,90]
[null,"Compact Cam (HCCU)",null,1,null,null,150,null,null,null,null,null,null,"User Defined Stroke"]
[null,"Force Cylinder (HCF)",null,"Cell-länk",null,null,null,null,null,null,null,null,null,10,"mm",null,null,null,null,null,"1. Select Cam / Force Cylinder"]
[null,"Flange Cam (HCCF)",null,null,null,null,null,null,null,null,null,null,null,null,null,null,null,"Till Listruta"]
[null,null,null,null,null,"Till Listruta",null,null,null,null,null,null,null,null,null,null,null,"Number of Cams"]
[null,null,null,null,null,"Recomended Power Units",null,null,null,null,null,null,null,null,null,null,null,1]
[null,"Tillhör Listbox_12",null,null,null,"HCPU-15x35     Compact Cam Velocity: 0,8 m/s     Ratio: 1",null,null,null,null,null,null,null,null,null,null,null,2]
[null,1,null,null,null,null,null,null,null,null,null,null,null,null,null,null,null,3]
[]
["Skriv in dessa manuellt"]
[null,"Power Unit (HCPU)",null,null,null,null,null,null,null,null,null,null,null,null,null,"Used Stroke Lock","Value"]
[null,"Power Unit with separate accumulator (HCPU-S)",null,1,null,null,null,null,null,null,null,null,null,null,null,false,null,null,null,null,null,null,null,null,null,null,null,null,null,null,null,{"$f":"IF(UsedStroke>Stroke,\"Too long Stroke\",\" \")","v":" "}]
[null,null,null,null,null,null,null,null,null,null,null,null,null,null,null,"Status"]
["HCPType",{"$f":"INDEX(B15:B16,D16)","v":"Power Unit (HCPU)"},null,null,null,null,null,null,null,null,null,null,null,null,null,"Kryssruta",null,null,null,null,{"$f":"CONCATENATE(\"Selected \",Product_Type)","v":"Selected Compact Cam"},null,{"$f":"CamDescription","v":"HCCU-15x10"}]
[null,null,null,null,null,null,null,null,null,null,null,null,null,"No. of Cams",null,null,null,null,null,null,"Working Force",null,{"$f":"CONCATENATE(CamMaxForce,\" kN\")","v":"15 kN"}]
[null,null,null,null,null,null,null,null,null,null,null,null,null,1,null,null,null,null,null,null,{"$f":"CONCATENATE(Product_Type,\" Oil Port\")","v":"Compact Cam Oil Port"},null,{"$f":"CamOilPort","v":"G 1/2"},null,"Total Needed Oil Volume",null,null,{"$f":"CONCATENATE(ROUND(OilVolumeUsed,2),\" L\")","v":"0,01 L"}]
[]
["Vald Cam Skrivs ut på rad 25"]
[]
[null,null,"Working Force (kN)","Stroke (mm)","Return Force (kN)","Max Frequency (spm)","Min Gas Pressure (bar)","Max Gas Pressure (bar)","Screw Mount","Flange Mount","Foot Mount","Top Mount","Proximity Sensor Kit","Sensors","Piston Area (dm2)","Description","Normal Pressure","Oil Port"]
["Compact Cam (HCCU)","Standard",15,10,2,60,125,180,"No Order No.",null,null,null,null,null,0.13,"HCCU-15x10",180,"G 1/2"]
[{"$f":"LEFT(A25,FIND(\"(\",A25)-2)","v":"Compact Cam"},null,null,null,null,null,null,null,null,null,null,null,null,null,null,null,null,null,null,null,{"$f":"IFERROR(VLOOKUP(3,$M$53:$O$56,3,FALSE),\"\")","v":""}]
[]
[null,null,null,3.2500000000000001E-2]
["Antal",null,null,6.5000000000000002E-2,null,null,null,null,null,null,null,null,"Oil Volume used",null,null,null,null,null,null,null,"2. Select HCPU Power Unit"]
[null,null,null,null,null,null,null,null,null,null,null,null,1.3000000268220901E-2]
[null,null,null,null,null,null,null,null,null,null,null,null,"New Stroke",null,null,null,null,null,null,null,"Press Velocity",null,0.8,"m/s","Max 0.8 m/s down stroke"]
[null,null,null,null,null,null,null,null,null,null,null,null,10]
[null,null,null,null,null,null,null,null,null,null,null,null,"Detta är använt slag"]
[]
[7]
[]
[]
["Usable Volume","Description","Type","Force (kN)","Stroke (mm)","Max Frequency (spm)","Min Gas Pressure (bar)","Max Gas Pressure (bar)",0.8,0.6,0.4,0.2,"Built in Accumulator","Piston Area (dm2)","Normal Filling Pressure","Oil Port"]
[]
[3.2500000000000001E-2,"HCPU-15x35","Power Unit (HCPU)",15,35,60,50,180,"1/2\"","3/8\"","3/8\"","3/8\"",1,0.13,150,"G 1/2\""]
[null,null,null,null,null,null,null,null,null,null,null,null,null,null,null,null,null,null,null,null,"Selected HCPU:",null,{"$f":"HCPDescription","v":"HCPU-15x35"}]
[null,null,null,null,null,null,null,null,null,null,null,null,null,null,null,null,null,null,null,null,"Used Stroke",null,{"$f":"CONCATENATE(HCPStroke,\" mm\")","v":"20 mm"},null,"(incl. 10 mm margin)"]
[null,null,null,null,null,null,null,null,null,null,null,null,null,null,null,null,null,null,null,null,"Max Frequency (SPM)",null,{"$f":"SPMLimit","v":60}]
[null,null,null,null,null,null,null,null,null,null,null,null,"ratio","HCP Stroke","Cam Speed",null,null,null,null,null,"Oil Port",null,{"$f":"HCPOilPort","v":"G 1/2\""},null,"Supplied Oil Volume Used Stroke",null,null,{"$f":"CONCATENATE(ROUND(OilVolumeUsed,2),\" L\")","v":"0,01 L"}]
[null,null,null,null,null,null,null,null,null,null,null,null,null,null,null,null,"Spm Limit",null,null,null,"Recommended Hose Size",null,{"$f":"HCPHoseDimension","v":"1/2\""},null,"Oil Volume Full Stroke",null,null,{"$f":"CONCATENATE(ROUND(Usable_Oil_Volume,2),\" L\")","v":"0,03 L"}]
[null,null,null,null,null,null,null,null,null,null,null,null,1,{"$f":"ROUND((NewStroke/SpeedRatio)+10,0)","v":20},{"$f":"UserHCPSpeed*SpeedRatio","v":0.8},null,60]
[]
[null,null,null,null,null,null,null,null,null,null,"Bilder",null,null,null,null,null,null,null,null,null,"3. Force Adjustments"]
[]
[null,null,null,null,null,null,null,null,null,null,null,null,null,null,null,null,null,null,null,null,null,null,null,"Gas Pressure",null,{"$f":"Product_Type","v":"Compact Cam"},null,null,null,"Power Unit"]
[null,null,null,null,null,null,null,null,null,null,null,null,null,null,null,null,null,null,null,null,"Force Adjustment"]
[null,null,null,null,null,null,null,null,null,null,null,null,null,null,null,null,null,null,null,null,"HCPU Accumulator gas charge pressure",null,null,150,"bar","Working Force",null,{"$f":"CONCATENATE(ROUND(UserCamForce,1),\" kN\")","v":"17,5 kN"},null,"Activating Force",null,{"$f":"CONCATENATE(ROUND(Activating_Force,1),\" kN\")","v":"19,5 kN"}]
[null,null,null,null,null,null,null,null,null,null,"Integrated Base Mount",{"$f":"ScrewMount","v":"No Order No."},{"$f":"_xlfn.RANK.EQ(1,N53:N56,1)","v":1},{"$f":"IF(O53<>\"\",1,\"\")","v":1},{"$f":"IF(L53<>0,K53,\"\")","v":"Integrated Base Mount"},null,null,null,null,null,{"$f":"CONCATENATE(\"Max \",HCPMaxGasPressure,\" bar , Min \",HCPMinGasPressure,\" bar\")","v":"Max 180 bar , Min 50 bar"},null,null,{"$f":"IF(OR(HCPAccumulatorPressure>HCPMaxGasPressure,HCPAccumulatorPressure<HCPMinGasPressure)=TRUE,\"Pressure out of range!\",\" \")","v":" "}]
[null,null,null,null,null,null,null,null,null,null,"Flange Mount",{"$f":"FlangeMount","v":0},{"$f":"_xlfn.RANK.EQ(2,N53:N56,1)","v":{"$error":"#N/A"}},{"$f":"IF(O54<>\"\",2,\"\")","v":""},{"$f":"IF(L54<>0,K54,\"\")","v":""}]
[null,"Slagdimension",null,null,null,null,null,null,null,null,"Foot Mount",{"$f":"FootMount","v":0},{"$f":"_xlfn.RANK.EQ(3,N53:N56,1)","v":{"$error":"#N/A"}},{"$f":"IF(O55<>\"\",3,\"\")","v":""},{"$f":"IF(L55<>0,K55,\"\")","v":""},null,null,null,null,null,{"$f":"CONCATENATE(Product_Type,\" gas charge pressure\")","v":"Compact Cam gas charge pressure"},null,null,180,"bar","Return Force",null,{"$f":"CONCATENATE(ROUND(UserReturnForce,1),\" kN\")","v":"2 kN"}]
[null,"HCP",{"$f":"IF(UserHCPSpeed>0.8,\"Too High Speed\",IF(UserHCPSpeed>0.6,HCP0_8Hose,IF(UserHCPSpeed>0.4,HCP0_6Hose,IF(UserHCPSpeed>0.2,HCP0_4Hose,HCP0_2Hose))))","v":"1/2\""},null,null,null,null,null,null,null,"Top Mount",{"$f":"TopMount","v":0},{"$f":"_xlfn.RANK.EQ(4,N53:N56,1)","v":{"$error":"#N/A"}},{"$f":"IF(O56<>\"\",4,\"\")","v":""},{"$f":"IF(L56<>0,K56,\"\")","v":""},null,null,null,null,null,{"$f":"CONCATENATE(\"Max \",CamMaxGasPressure,\" bar , Min \",CamMinGasPressure,\" bar\")","v":"Max 180 bar , Min 125 bar"},null,null,{"$f":"IF(OR(CamGasFillingPressure>CamMaxGasPressure,CamGasFillingPressure<CamMinGasPressure)=TRUE,\"Pressure out of range!\",\" \")","v":" "}]
[]
[null,"CAMs",{"$f":"IF(CamSpeed>0.8,\"Too High Speed\",IF(CamSpeed>0.6,B70,IF(CamSpeed>0.4,C70,IF(CamSpeed>0.2,D70,E70))))","v":"1/2\""},null,null,null,null,null,null,null,null,null,2]
[null,null,null,null,null,null,null,null,null,null,null,null,{"$f":"IF(SUM(N53:N56)=1,1,M58)","v":1},{"$f":"4-COUNTBLANK(N53:N56)","v":1},null,null,null,null,null,null,"4. Selection Summary"]
[]
[null,"Cam Force",{"$f":"HCPAccumulatorPressure*PistonArea-UserReturnForce","v":17.5},null,"Activating Force",null,null,null,null,null,{"$f":"IFERROR(VLOOKUP(1,$M$53:$O$56,3,FALSE),\"\")","v":"Integrated Base Mount"},null,null,null,null,null,null,null,null,null,"Description",null,"Order No.",null,"Quantity",null,"Working Force",null,"Used Stroke",null,"Velocity"]
[null,"Return Force",{"$f":"(CamGasFillingPressure/NormalCamPressure)*CamReturnForce","v":2},null,{"$f":"HCPAccumulatorPressure*HCPPistonArea","v":19.5},null,null,null,null,null,{"$f":"IFERROR(VLOOKUP(2,$M$53:$O$56,3,FALSE),\"\")","v":""}]
[null,null,null,null,null,null,null,null,null,null,null,null,null,null,null,null,null,null,null,null,{"$f":"Product_Type","v":"Compact Cam"},null,{"$f":"CamDescription","v":"HCCU-15x10"},null,{"$f":"CONCATENATE(NumberOfCams,\" pc\")","v":"1 pc"},null,{"$f":"CONCATENATE(ROUND(UserCamForce,1),\" kN\")","v":"17,5 kN"},null,{"$f":"CONCATENATE(Stroke,\" mm\")","v":"10 mm"},null,{"$f":"CONCATENATE(ROUND(CamSpeed,2),\" m/s\")","v":"0,8 m/s"}]
[null,null,null,null,null,null,null,null,null,null,null,null,null,null,null,null,null,null,null,null,"Power Unit",null,{"$f":"HCPDescription","v":"HCPU-15x35"},null,"1 pc",null,null,null,{"$f":"CONCATENATE(HCPStroke,\" mm\")","v":"20 mm"},null,{"$f":"CONCATENATE(UserHCPSpeed,\" m/s\")","v":"0,8 m/s"}]
[null,null,null,null,null,null,null,null,null,null,null,null,1,{"$f":"2-COUNTBLANK(ProximitySensor)","v":1}]
[null,null,null,null,null,null,null,null,null,null,null,null,{"$f":"IF(AND(M65=2,ISBLANK(ProximitySensor)),1,M65)","v":1},null,null,null,null,null,null,null,"Hose Size",{"$f":"HCPHoseDimension","v":"1/2\""},{"$f":"VLOOKUP(HCPHoseDimension,Hoses,2,FALSE)","v":"30 214 54 - xxxx"}]
[null,null,null,null,null,null,null,null,null,null,{"$f":"IF(ProximitySensor<>0,\"Options\",\"\")","v":""},null,null,null,1,"No Option"]
[null,"Cam Hose Dimensions",{"$f":"CamMaxForce","v":15},null,null,null,null,null,null,null,{"$f":"IF(ProximitySensor<>0,\"Proximity Sensor Kit\",\"\")","v":""},null,{"$f":"IF(ProximitySensor<>0,CONCATENATE(\"Proximity Sensor Kit \",\"     Order No. \",ProximitySensor),\"\")","v":""},null,2,"Proximity Sensor",null,null,null,null,{"$f":"VLOOKUP(M59,M53:O56,3,FALSE)","v":"Integrated Base Mount"},null,{"$f":"VLOOKUP(U68,K53:L56,2,FALSE)","v":"No Order No."}]
[null,0.8,0.8,0.4,0.2,null,null,null,null,null,{"$f":"IF(ProximitySensor<>0,\"Sensor Part No.\",\"\")","v":""},null,{"$f":"IF(ProximitySensor<>0,CONCATENATE(\"Order No. \",SensorNr),\"\")","v":""}]
[null,{"$f":"VLOOKUP(CamMaxForce,Drivare!$D2:$L40,6)","v":"1/2\""},{"$f":"VLOOKUP(CamMaxForce,Drivare!$D2:$L40,7)","v":"3/8\""},{"$f":"VLOOKUP(CamMaxForce,Drivare!$D2:$L40,8)","v":"3/8\""},{"$f":"VLOOKUP(CamMaxForce,Drivare!$D2:$L40,9)","v":"3/8\""},null,null,null,null,null,null,null,null,null,null,null,null,null,null,null,{"$f":"VLOOKUP(Index_ListBoxOption,$O$67:$P$68,2,FALSE)","v":"No Option"}]
[null,null,null,null,null,null,null,null,null,null,null,null,null,null,null,null,null,null,null,null,{"$f":"IF(U70=\"Proximity Sensor\",\"Kit\",\"\")","v":""},null,{"$f":"IF(U70=\"Proximity Sensor\",ProximitySensor,\"\")","v":""}]
[null,null,null,null,null,null,null,null,null,null,null,null,null,null,null,null,null,null,null,null,{"$f":"IF(U70=\"Proximity Sensor\",\"2 pcs Sensors\",\"\")","v":""},null,{"$f":"IF(U70=\"Proximity Sensor\",SensorNr,\"\")","v":""}]
[]
[]
[null,null,null,null,null,null,null,null,null,null,null,null,null,null,null,null,null,null,null,null,"IMPORTANT:"]
[]
[]
[]
[]
[]
[]
[]
[]
[]
[null,null,null,null,null,null,null,null,null,null,null,null,null,null,null,null,null,null,null,null,"Please send feeback and comments to:",null,null,"Orders@hysonsolutions.com",null,null," "]

{"sheet":"Kammar","index":1,"n_rows":77,"n_cols":18,"rows_kept":77,"cut":false,"hidden":true,"merged":[]}
[null,null,"Working Force (kN)","Stroke (mm)","Return Force (kN)","Max Frequency (spm)","Min Gas Pressure (bar)","Max Gas Pressure (bar)","Screw Mount","Flange Mount","Foot Mount","Top Mount","Proximity Sensor Kit","Sensors","Piston Area (dm2)","Description","Normal Gas pressure","Oil Port size"]
["Compact Cam (HCCU)","Standard",15,10,2,60,125,180,"No Order No.",null,null,null,null,"",0.13,"HCCU-15x10",180,"G 1/2"]
["Compact Cam (HCCU)","Standard",15,24,2,60,125,180,"No Order No.",null,null,null,"3018208-1",503550,0.13,"HCCU-15x24",180,"G 1/2"]
["Compact Cam (HCCU)","Standard",15,49,2,60,125,180,"No Order No.",null,null,null,"3018208-2",503550,0.13,"HCCU-15x49",180,"G 1/2"]
["Compact Cam (HCCU)","With Gas Hose Connection (-H)",15,10,2,60,125,180,"No Order No.",null,null,null,null,"",0.13,"HCCH-15x10",180,"G 1/2"]
["Compact Cam (HCCU)","With Gas Hose Connection (-H)",15,24,2,60,125,180,"No Order No.",null,null,null,"3018208-1",503550,0.13,"HCCH-15x24",180,"G 1/2"]
["Compact Cam (HCCU)","With Gas Hose Connection (-H)",15,49,2,60,125,180,"No Order No.",null,null,null,"3018208-2",503550,0.13,"HCCH-15x49",180,"G 1/2"]
["Force Cylinder (HCF)","Standard",15,25,1.5,60,10,40,null,"2014677-0750","3016977-015",null,null,null,0.13,"HCF-15x25",20,"G 1/2"]
["Force Cylinder (HCF)","Standard",15,50,1.5,60,10,40,null,"2014677-0750","3016977-015",null,null,null,0.13,"HCF-15x50",20,"G 1/2"]
["Force Cylinder (HCF)","Standard",15,100,1.5,60,10,40,null,"2014677-0750","3016977-015",null,null,null,0.13,"HCF-15x100",20,"G 1/2"]
["Force Cylinder (HCF)","Standard",15,150,1.5,60,10,40,null,"2014677-0750","3016977-015",null,null,null,0.13,"HCF-15x150",20,"G 1/2"]
["Force Cylinder (HCF)","With Side Port Plate (-SP)",15,25,1.5,60,10,40,"No Order No.",null,null,null,null,null,0.13,"HCF-SP-15x25",20,"G 1/2"]
["Force Cylinder (HCF)","With Side Port Plate (-SP)",15,50,1.5,60,10,40,"No Order No.",null,null,null,null,null,0.13,"HCF-SP-15x50",20,"G 1/2"]
["Force Cylinder (HCF)","With Side Port Plate (-SP)",15,100,1.5,60,10,40,"No Order No.",null,null,null,null,null,0.13,"HCF-SP-15x100",20,"G 1/2"]
["Force Cylinder (HCF)","With Side Port Plate (-SP)",15,150,1.5,60,10,40,"No Order No.",null,null,null,null,null,0.13,"HCF-SP-15x150",20,"G 1/2"]
["Compact Cam (HCCU)","Standard",40,24,4,60,125,180,"No Order No.",null,null,null,"3018208-3",503550,0.31,"HCCU-40x24",180,"G 3/4"]
["Compact Cam (HCCU)","Standard",40,49,4,60,125,180,"No Order No.",null,null,null,"3018208-4",503550,0.31,"HCCU-40x49",180,"G 3/4"]
["Compact Cam (HCCU)","Standard",40,99,4,60,125,180,"No Order No.",null,null,null,"3018208-5",503550,0.31,"HCCU-40x99",180,"G 3/4"]
["Compact Cam (HCCU)","Standard",40,124,4,60,125,180,"No Order No.",null,null,null,"3018208-15",503550,0.31,"HCCU-40x124",180,"G 3/4"]
["Compact Cam (HCCU)","With Gas Hose Connection (-H)",40,24,4,60,125,180,"No Order No.",null,null,null,"3018208-3",503550,0.31,"HCCH-40x24",180,"G 3/4"]
["Compact Cam (HCCU)","With Gas Hose Connection (-H)",40,49,4,60,125,180,"No Order No.",null,null,null,"3018208-4",503550,0.31,"HCCH-40x49",180,"G 3/4"]
["Compact Cam (HCCU)","With Gas Hose Connection (-H)",40,99,4,60,125,180,"No Order No.",null,null,null,"3018208-5",503550,0.31,"HCCH-40x99",180,"G 3/4"]
["Compact Cam (HCCU)","With Gas Hose Connection (-H)",40,124,4,60,125,180,"No Order No.",null,null,null,"3018208-15",503550,0.31,"HCCH-40x124",180,"G 3/4"]
["Flange Cam (HCCF)","Standard",40,49,4,60,125,180,"No Order No.",null,null,2018393,null,null,0.31,"HCCF-40x49",180,"G 3/4"]
["Flange Cam (HCCF)","Standard",40,99,4,60,125,180,"No Order No.",null,null,2018393,null,null,0.31,"HCCF-40x99",180,"G 3/4"]
["Flange Cam (HCCF)","With Gas Hose Connection (-H)",40,49,4,60,125,180,"No Order No.",null,null,2018393,null,null,0.31,"HCCF-H-40x49",180,"G 3/4"]
["Flange Cam (HCCF)","With Gas Hose Connection (-H)",40,99,4,60,125,180,"No Order No.",null,null,2018393,null,null,0.31,"HCCF-H-40x99",180,"G 3/4"]
["Force Cylinder (HCF)","Standard",40,25,4,60,10,40,null,"2014677-1500","3016977-040",null,null,null,0.31,"HCF-40x25",20,"G 3/4"]
["Force Cylinder (HCF)","Standard",40,50,4,60,10,40,null,"2014677-1500","3016977-040",null,null,null,0.31,"HCF-40x50",20,"G 3/4"]
["Force Cylinder (HCF)","Standard",40,100,4,60,10,40,null,"2014677-1500","3016977-040",null,null,null,0.31,"HCF-40x100",20,"G 3/4"]
["Force Cylinder (HCF)","Standard",40,150,4,60,10,40,null,"2014677-1500","3016977-040",null,null,null,0.31,"HCF-40x150",20,"G 3/4"]
["Force Cylinder (HCF)","With Side Port Plate (-SP)",40,25,4,60,10,40,"No Order No.",null,null,null,null,null,0.31,"HCF-SP-40x25",20,"G 3/4"]
["Force Cylinder (HCF)","With Side Port Plate (-SP)",40,50,4,60,10,40,"No Order No.",null,null,null,null,null,0.31,"HCF-SP-40x50",20,"G 3/4"]
["Force Cylinder (HCF)","With Side Port Plate (-SP)",40,100,4,60,10,40,"No Order No.",null,null,null,null,null,0.31,"HCF-SP-40x100",20,"G 3/4"]
["Force Cylinder (HCF)","With Side Port Plate (-SP)",40,150,4,60,10,40,"No Order No.",null,null,null,null,null,0.31,"HCF-SP-40x150",20,"G 3/4"]
["Compact Cam (HCCU)","Standard",60,24,7,60,125,180,"No Order No.",null,null,null,"3018208-09",503550,0.5,"HCCU-60x24",180,"G 3/4"]
["Compact Cam (HCCU)","Standard",60,49,7,60,125,180,"No Order No.",null,null,null,"3018208-10",503550,0.5,"HCCU-60x49",180,"G 3/4"]
["Compact Cam (HCCU)","Standard",60,99,7,60,125,180,"No Order No.",null,null,null,"3018208-11",503550,0.5,"HCCU-60x99",180,"G 3/4"]
["Compact Cam (HCCU)","With Gas Hose Connection (-H)",60,24,7,60,125,180,"No Order No.",null,null,null,"3018208-09",503550,0.5,"HCCH-60x24",180,"G 3/4"]
["Compact Cam (HCCU)","With Gas Hose Connection (-H)",60,49,7,60,125,180,"No Order No.",null,null,null,"3018208-10",503550,0.5,"HCCH-60x49",180,"G 3/4"]
["Compact Cam (HCCU)","With Gas Hose Connection (-H)",60,99,7,60,125,180,"No Order No.",null,null,null,"3018208-11",503550,0.5,"HCCH-60x99",180,"G 3/4"]
["Force Cylinder (HCF)","Standard",60,25,6,60,10,40,null,"2014677-3000","3016977-060",null,null,null,0.5,"HCF-60x25",20,"G 3/4"]
["Force Cylinder (HCF)","Standard",60,50,6,60,10,40,null,"2014677-3000","3016977-060",null,null,null,0.5,"HCF-60x50",20,"G 3/4"]
["Force Cylinder (HCF)","Standard",60,100,6,60,10,40,null,"2014677-3000","3016977-060",null,null,null,0.5,"HCF-60x100",20,"G 3/4"]
["Force Cylinder (HCF)","Standard",60,150,6,60,10,40,null,"2014677-3000","3016977-060",null,null,null,0.5,"HCF-60x150",20,"G 3/4"]
["Force Cylinder (HCF)","With Side Port Plate (-SP)",60,25,6,60,10,40,"No Order No.",null,null,null,null,null,0.5,"HCF-SP-60x25",20,"G 3/4"]
["Force Cylinder (HCF)","With Side Port Plate (-SP)",60,50,6,60,10,40,"No Order No.",null,null,null,null,null,0.5,"HCF-SP-60x50",20,"G 3/4"]
["Force Cylinder (HCF)","With Side Port Plate (-SP)",60,100,6,60,10,40,"No Order No.",null,null,null,null,null,0.5,"HCF-SP-60x100",20,"G 3/4"]
["Force Cylinder (HCF)","With Side Port Plate (-SP)",60,150,6,60,10,40,"No Order No.",null,null,null,null,null,0.5,"HCF-SP-60x150",20,"G 3/4"]
["Compact Cam (HCCU)","Standard",90,24,10,30,105,150,"No Order No.",null,null,null,"3018208-6",503550,0.79,"HCCU-90x24",150,"G 3/4"]
["Compact Cam (HCCU)","Standard",90,49,10,30,105,150,"No Order No.",null,null,null,"3018208-7",503550,0.79,"HCCU-90x49",150,"G 3/4"]
["Compact Cam (HCCU)","Standard",90,99,10,30,105,150,"No Order No.",null,null,null,"3018208-8",503550,0.79,"HCCU-90x99",150,"G 3/4"]
["Compact Cam (HCCU)","With Gas Hose Connection (-H)",90,24,10,30,105,150,"No Order No.",null,null,null,"3018208-6",503550,0.79,"HCCH-90x24",150,"G 3/4"]
["Compact Cam (HCCU)","With Gas Hose Connection (-H)",90,49,10,30,105,150,"No Order No.",null,null,null,"3018208-7",503550,0.79,"HCCH-90x49",150,"G 3/4"]
["Compact Cam (HCCU)","With Gas Hose Connection (-H)",90,99,10,30,105,150,"No Order No.",null,null,null,"3018208-8",503550,0.79,"HCCH-90x99",150,"G 3/4"]
["Force Cylinder (HCF)","Standard",90,25,9,30,10,40,null,"2014677-5000","3016977-090",null,null,null,0.79,"HCF-90x25",20,"G 3/4"]
["Force Cylinder (HCF)","Standard",90,50,9,30,10,40,null,"2014677-5000","3016977-090",null,null,null,0.79,"HCF-90x50",20,"G 3/4"]
["Force Cylinder (HCF)","Standard",90,100,9,30,10,40,null,"2014677-5000","3016977-090",null,null,null,0.79,"HCF-90x100",20,"G 3/4"]
["Force Cylinder (HCF)","Standard",90,150,9,30,10,40,null,"2014677-5000","3016977-090",null,null,null,0.79,"HCF-90x150",20,"G 3/4"]
["Force Cylinder (HCF)","With Side Port Plate (-SP)",90,25,9,30,10,40,"No Order No.",null,null,null,null,null,0.79,"HCF-SP-90x25",20,"G 3/4"]
["Force Cylinder (HCF)","With Side Port Plate (-SP)",90,50,9,30,10,40,"No Order No.",null,null,null,null,null,0.79,"HCF-SP-90x50",20,"G 3/4"]
["Force Cylinder (HCF)","With Side Port Plate (-SP)",90,100,9,30,10,40,"No Order No.",null,null,null,null,null,0.79,"HCF-SP-90x100",20,"G 3/4"]
["Force Cylinder (HCF)","With Side Port Plate (-SP)",90,150,9,30,10,40,"No Order No.",null,null,null,null,null,0.79,"HCF-SP-90x150",20,"G 3/4"]
["Compact Cam (HCCU)","Standard",150,24,15,30,105,150,"No Order No.",null,null,null,"3018208-12",503550,1.23,"HCCU-150x24",150,"G 1 1/4"]
["Compact Cam (HCCU)","Standard",150,49,15,30,105,150,"No Order No.",null,null,null,"3018208-13",503550,1.23,"HCCU-150x49",150,"G 1 1/4"]
["Compact Cam (HCCU)","Standard",150,99,15,30,105,150,"No Order No.",null,null,null,"3018208-14",503550,1.23,"HCCU-150x99",150,"G 1 1/4"]
["Compact Cam (HCCU)","With Gas Hose Connection (-H)",150,24,15,30,105,150,"No Order No.",null,null,null,"3018208-12",503550,1.23,"HCCH-150x24",150,"G 1 1/4"]
["Compact Cam (HCCU)","With Gas Hose Connection (-H)",150,49,15,30,105,150,"No Order No.",null,null,null,"3018208-13",503550,1.23,"HCCH-150x49",150,"G 1 1/4"]
["Compact Cam (HCCU)","With Gas Hose Connection (-H)",150,99,15,30,105,150,"No Order No.",null,null,null,"3018208-14",503550,1.23,"HCCH-150x99",150,"G 1 1/4"]
["Force Cylinder (HCF)","Standard",150,25,30,30,10,40,null,"2014677-7500",null,null,null,null,1.23,"HCF-150x25",20,"G 1 1/4"]
["Force Cylinder (HCF)","Standard",150,50,30,30,10,40,null,"2014677-7500",null,null,null,null,1.23,"HCF-150x50",20,"G 1 1/4"]
["Force Cylinder (HCF)","Standard",150,100,30,30,10,40,null,"2014677-7500",null,null,null,null,1.23,"HCF-150x100",20,"G 1 1/4"]
["Force Cylinder (HCF)","Standard",150,150,30,30,10,40,null,"2014677-7500",null,null,null,null,1.23,"HCF-150x150",20,"G 1 1/4"]
["Force Cylinder (HCF)","With Side Port Plate (-SP)",150,25,30,30,10,40,"No Order No.",null,null,null,null,null,1.23,"HCF-SP-150x25",20,"G 1 1/4"]
["Force Cylinder (HCF)","With Side Port Plate (-SP)",150,50,30,30,10,40,"No Order No.",null,null,null,null,null,1.23,"HCF-SP-150x50",20,"G 1 1/4"]
["Force Cylinder (HCF)","With Side Port Plate (-SP)",150,100,30,30,10,40,"No Order No.",null,null,null,null,null,1.23,"HCF-SP-150x100",20,"G 1 1/4"]
["Force Cylinder (HCF)","With Side Port Plate (-SP)",150,150,30,30,10,40,"No Order No.",null,null,null,null,null,1.23,"HCF-SP-150x150",20,"G 1 1/4"]

{"sheet":"Drivare","index":2,"n_rows":41,"n_cols":16,"rows_kept":41,"cut":false,"hidden":true,"merged":[]}
["Usable Volume","Description","Type","Force (kN)","Stroke (mm)","Max Frequency (spm)","Min Gas Pressure (bar)","Max Gas Pressure (bar)",0.8,0.6,0.4,0.2,"Built in Accumulator","Piston Area (dm2)","Normal Filling Pressure","Oil Port"]
[{"$f":"(E2-10)*0.01*N2","v":3.2500000000000001E-2},"HCPU-15x35","Power Unit (HCPU)",15,35,60,50,180,"1/2\"","3/8\"","3/8\"","3/8\"",1,0.13,150,"G 1/2\""]
[6.5000000000000002E-2,"HCPU-15x60","Power Unit (HCPU)",15,60,60,50,180,"1/2\"","3/8\"","3/8\"","3/8\"",1,0.13,150,"G 1/2\""]
[0.13,"HCPU-15x110","Power Unit (HCPU)",15,110,60,50,180,"1/2\"","3/8\"","3/8\"","3/8\"",1,0.13,150,"G 1/2\""]
[0.19500000000000001,"HCPU-15x160","Power Unit (HCPU)",15,160,60,50,180,"1/2\"","3/8\"","3/8\"","3/8\"",1,0.13,150,"G 1/2\""]
[3.2500000000000001E-2,"HCPU-S-15x35","Power Unit with separate accumulator (HCPU-S)",15,35,60,50,180,"1/2\"","3/8\"","3/8\"","3/8\"",0,0.13,150,"G 1/2\""]
[6.5000000000000002E-2,"HCPU-S-15x60","Power Unit with separate accumulator (HCPU-S)",15,60,60,50,180,"1/2\"","3/8\"","3/8\"","3/8\"",0,0.13,150,"G 1/2\""]
[0.13,"HCPU-S-15x110","Power Unit with separate accumulator (HCPU-S)",15,110,60,50,180,"1/2\"","3/8\"","3/8\"","3/8\"",0,0.13,150,"G 1/2\""]
[0.19500000000000001,"HCPU-S-15x160","Power Unit with separate accumulator (HCPU-S)",15,160,60,50,180,"1/2\"","3/8\"","3/8\"","3/8\"",0,0.13,150,"G 1/2\""]
[7.7499999999999999E-2,"HCPU-40x35","Power Unit (HCPU)",40,35,60,50,180,"3/4\"","3/4\"","1/2\"","1/2\"",1,0.31,150,"G 3/4\""]
[0.155,"HCPU-40x60","Power Unit (HCPU)",40,60,60,50,180,"3/4\"","3/4\"","1/2\"","1/2\"",1,0.31,150,"G 3/4\""]
[0.31,"HCPU-40x110","Power Unit (HCPU)",40,110,60,50,180,"3/4\"","3/4\"","1/2\"","1/2\"",1,0.31,150,"G 3/4\""]
[0.46499999999999997,"HCPU-40x160","Power Unit (HCPU)",40,160,60,50,180,"3/4\"","3/4\"","1/2\"","1/2\"",1,0.31,150,"G 3/4\""]
[7.7499999999999999E-2,"HCPU-S-40x35","Power Unit with separate accumulator (HCPU-S)",40,35,60,50,180,"3/4\"","3/4\"","1/2\"","1/2\"",0,0.31,150,"G 3/4\""]
[0.155,"HCPU-S-40x60","Power Unit with separate accumulator (HCPU-S)",40,60,60,50,180,"3/4\"","3/4\"","1/2\"","1/2\"",0,0.31,150,"G 3/4\""]
[0.31,"HCPU-S-40x110","Power Unit with separate accumulator (HCPU-S)",40,110,60,50,180,"3/4\"","3/4\"","1/2\"","1/2\"",0,0.31,150,"G 3/4\""]
[0.46499999999999997,"HCPU-S-40x160","Power Unit with separate accumulator (HCPU-S)",40,160,60,50,180,"3/4\"","3/4\"","1/2\"","1/2\"",0,0.31,150,"G 3/4\""]
[0.125,"HCPU-60x35","Power Unit (HCPU)",60,35,60,50,180,"1\"","3/4\"","3/4\"","1/2\"",1,0.5,150,"G 3/4\""]
[0.25,"HCPU-60x60","Power Unit (HCPU)",60,60,60,50,180,"1\"","3/4\"","3/4\"","1/2\"",1,0.5,150,"G 3/4\""]
[0.5,"HCPU-60x110","Power Unit (HCPU)",60,110,60,50,180,"1\"","3/4\"","3/4\"","1/2\"",1,0.5,150,"G 3/4\""]
[0.75,"HCPU-60x160","Power Unit (HCPU)",60,160,60,50,180,"1\"","3/4\"","3/4\"","1/2\"",1,0.5,150,"G 3/4\""]
[0.125,"HCPU-S-60x35","Power Unit with separate accumulator (HCPU-S)",60,35,60,50,180,"1\"","3/4\"","3/4\"","1/2\"",0,0.5,150,"G 3/4\""]
[0.25,"HCPU-S-60x60","Power Unit with separate accumulator (HCPU-S)",60,60,60,50,180,"1\"","3/4\"","3/4\"","1/2\"",0,0.5,150,"G 3/4\""]
[0.5,"HCPU-S-60x110","Power Unit with separate accumulator (HCPU-S)",60,110,60,50,180,"1\"","3/4\"","3/4\"","1/2\"",0,0.5,150,"G 3/4\""]
[0.75,"HCPU-S-60x160","Power Unit with separate accumulator (HCPU-S)",60,160,60,50,180,"1\"","3/4\"","3/4\"","1/2\"",0,0.5,150,"G 3/4\""]
[0.19750000000000001,"HCPU-90x35","Power Unit (HCPU)",90,35,30,50,180,"1\"","1\"","3/4\"","1/2\"",1,0.79,150,"G 3/4\""]
[0.39500000000000002,"HCPU-90x60","Power Unit (HCPU)",90,60,30,50,180,"1\"","1\"","3/4\"","1/2\"",1,0.79,150,"G 3/4\""]
[0.79,"HCPU-90x110","Power Unit (HCPU)",90,110,30,50,180,"1\"","1\"","3/4\"","1/2\"",1,0.79,150,"G 3/4\""]
[1.1850000000000001,"HCPU-90x160","Power Unit (HCPU)",90,160,30,50,180,"1\"","1\"","3/4\"","1/2\"",1,0.79,150,"G 3/4\""]
[0.19750000000000001,"HCPU-S-90x35","Power Unit with separate accumulator (HCPU-S)",90,35,30,50,180,"1\"","1\"","3/4\"","1/2\"",0,0.79,150,"G 3/4\""]
[0.39500000000000002,"HCPU-S-90x60","Power Unit with separate accumulator (HCPU-S)",90,60,30,50,180,"1\"","1\"","3/4\"","1/2\"",0,0.79,150,"G 3/4\""]
[0.79,"HCPU-S-90x110","Power Unit with separate accumulator (HCPU-S)",90,110,30,50,180,"1\"","1\"","3/4\"","1/2\"",0,0.79,150,"G 3/4\""]
[1.1850000000000001,"HCPU-S-90x160","Power Unit with separate accumulator (HCPU-S)",90,160,30,50,180,"1\"","1\"","3/4\"","1/2\"",0,0.79,150,"G 3/4\""]
[0.3075,"HCPU-150x35","Power Unit (HCPU)",150,35,30,50,180,"1 1/4\"","1 1/4\"","1\"","3/4\"",1,1.23,150,"G 1 1/4\""]
[0.61499999999999999,"HCPU-150x60","Power Unit (HCPU)",150,60,30,50,180,"1 1/4\"","1 1/4\"","1\"","3/4\"",1,1.23,150,"G 1 1/4\""]
[1.23,"HCPU-150x110","Power Unit (HCPU)",150,110,30,50,180,"1 1/4\"","1 1/4\"","1\"","3/4\"",1,1.23,150,"G 1 1/4\""]
[1.845,"HCPU-150x160","Power Unit (HCPU)",150,160,30,50,180,"1 1/4\"","1 1/4\"","1\"","3/4\"",1,1.23,150,"G 1 1/4\""]
[0.3075,"HCPU-S-150x35","Power Unit with separate accumulator (HCPU-S)",150,35,30,50,180,"1 1/4\"","1 1/4\"","1\"","3/4\"",0,1.23,150,"G 1 1/4\""]
[0.61499999999999999,"HCPU-S-150x60","Power Unit with separate accumulator (HCPU-S)",150,60,30,50,180,"1 1/4\"","1 1/4\"","1\"","3/4\"",0,1.23,150,"G 1 1/4\""]
[1.23,"HCPU-S-150x110","Power Unit with separate accumulator (HCPU-S)",150,110,30,50,180,"1 1/4\"","1 1/4\"","1\"","3/4\"",0,1.23,150,"G 1 1/4\""]
[1.845,"HCPU-S-150x160","Power Unit with separate accumulator (HCPU-S)",150,160,30,50,180,"1 1/4\"","1 1/4\"","1\"","3/4\"",0,1.23,150,"G 1 1/4\""]

{"sheet":"Slangar","index":3,"n_rows":10,"n_cols":4,"rows_kept":10,"cut":false,"hidden":true,"merged":[]}
[]
[]
[]
[]
[null,null,"Slangar"]
[null,null,"3/8\"","30 222 15 - xxxx"]
[null,null,"1/2\"","30 214 54 - xxxx"]
[null,null,"3/4\"","30 214 55 - xxxx"]
[null,null,"1\"","30 214 56 - xxxx"]
[null,null,"1 1/4\"","30 214 57 - xxxx"]

{"sheet":"Blad1","index":4,"n_rows":0,"n_cols":0,"rows_kept":0,"cut":false,"hidden":true,"merged":[]}