{"text_format":"1","workbook":"xlsx","n_sheets":9,"sheets":["Calculator","Produkter","Length_Adjustment","Heat_Factor","Fjäderkurva","Excenterpress","Spring_Back","För_Helpdesk","Blad1"],"not_rendered":{"charts":14,"images":13,"macros":1,"external_links":0,"defined_names":77,"comments":0,"pivot_tables":0},"unopened":[],"bounds":{"document_bytes":16777216,"sheet_cells":100000,"rows_first":2000,"rows_last":500,"rows_between":2000,"halvings":0,"cell_chars":16384,"cell_head_chars":4096},"cells_cut":0,"cells_raw":0,"read":"whole","date_system":"1900"}

{"sheet":"Calculator","index":0,"n_rows":99,"n_cols":29,"rows_kept":99,"cut":false,"hidden":false,"merged":[]}
[null,null,null,null,null,"List_Box_2","List_Box_3"]
[null,"Index 2","Index 3","Index 4",null,"CS2-A 1500",1500]
[null,1,1,1,null,"CS2-A 3000"]
[null,null,null,null,null,"CS2-A 5000"]
["Skriv i dessa manuellt för List_box_1",null,null,"Index 1",null,"CS2-A 7500",null,null,null,null,null,null,null,null,null,null,null,null,null,null,"Select CS Spring"]
[null,"Adjustable",null,1]
[null,"Non Adjustable",null,"Cell-länk"]
[]
[]
[]
[null,"Tillhör Listbox_12"]
[null,1]
[]
["Skriv in dessa manuellt"]
[null,"Power Unit (HCP)"]
[null,"Power Unit with separate accumulator (HCP-S)",null,1,null,null,null,null,null,null,null,null,null,null,null,null,null,null,null,null,"Min. Charge Pressure",null,{"$f":"MinGasPressure","v":25},"bar"]
[null,null,null,null,null,null,null,null,null,null,null,null,null,null,null,null,null,null,null,null,"Max. Charge Pressure",null,{"$f":"MaxGasPressure","v":150},"bar"]
["HCPType",{"$f":"INDEX(B15:B16,D16)","v":"Power Unit (HCP)"},null,null,null,null,null,null,null,null,null,null,null,null,null,null,null,null,null,null,"Min. Stroke Length",null,{"$f":"MinStrokelength","v":5},"mm"]
[null,null,null,null,null,null,null,null,null,null,null,null,null,null,null,null,null,null,null,null,"Max. Stroke Length",null,{"$f":"MaxStrokeLength","v":17},"mm"]
[]
[null,null,null,null,null,null,null,null,null,null,null,null,null,null,null,null,null,null,null,null,"Charge Pressure",null,150,"bar"]
["Vald KF Skrivs ut på rad 25"]
[]
[null,"Model size",null,"Stroke (mm)","Return Speed","Piston Rod Diameter","Min Gas Pressure (bar)",null,"Min Stroke Length","Max Stroke Length","L min","Fi","Fs","Tube Diameter","Piston Area (dm2)","Description"]
["Adjustable","CS2-A 1500",1500,10,0.2,36,25,150,5,17,142,15000,22000,80,"-","CS2-A 1500-10"]
[]
[]
[]
[]
[]
[]
[]
[]
[]
[]
[]
[]
[]
[]
[null,null,null,null,null,null,null,null,null,null,null,null,null,null,null,null,null,null,null,null,"Heat Calculation"]
[]
[null,null,null,null,null,null,null,null,null,null,null,null,null,null,null,null,null,null,null,null,"Strokes per minute",null,10,"spm"]
[null,null,null,null,null,null,null,null,null,null,null,null,"KF Spring locking time",1,"s",null,null,null,null,null,"Surrounding Temperature (Catalog values based on 20°C)",null,20,"°C"]
[]
[null,null,null,null,null,null,null,null,null,null,null,null,null,null,null,null,null,null,null,null,{"$f":"Heat_Data","v":"Heat Factor"},50,"mm/min",0,0]
[null,null,null,null,null,null,null,null,null,null,null,null,null,null,null,null,null,null,null,null,"Total Power",1.8131836826524736E-2,"kW",0,0]
[null,null,null,null,null,null,null,null,null,null,null,null,null,null,null,null,null,null,null,null,0,0,0,0,0]
[null,null,null,null,null,null,null,null,null,null,null,null,null,null,null,null,null,null,null,null,0,"Max Heat Factor mm/min","Max Power kW","Utilisation",0,{"$f":"\"Cooler Capacity for \"&User_Surrounding_Temperature&\"°C\"","v":"Cooler Capacity for 20°C"}]
[null,null,null,null,null,null,null,"Strokes List","Used Stroke Length",null,null,null,1,null,"ListBox_Cooling",null,null,null,null,null,"No cooling",451.47375,0.16372096732918445,0.11074841006813796,"OK","10 kW Liquid Cooler",null,{"$f":"Liquid_Cooler_10kW_Capacity","v":10.714285714285714},"kW"]
[null,null,null,null,null,null,null,null,null,null,null,null,"Quantity Listbox",null,null,"Cooling Altenatives","Antal Rader",null,null,null,"Liquid cooling",2295.9183673469383,0.83258434407511539,2.1777777777777781E-2,"OK","25kW Liquid Cooler",null,{"$f":"Liquid_Cooler_25kW_Capacity","v":26.785714285714285},"kW"]
[null,null,null,null,null,null,null,10,{"$f":"MinStrokelength","v":5},{"$f":"MATCH(MinStrokelength,I51:I68)","v":1},1,null,1,null,{"$f":"Heat_Factor!T43","v":"No cooling"},{"$f":"SUM(Heat_Factor!I16:I18)","v":3},{"$f":"IF(Cooling_Ant=0,1,Cooling_Ant)","v":3},null,null,null,"Nitro Cooler",3673.4693877551017,1.3321349505201847,1.3611111111111112E-2,"OK","Nitro Cooler",null,{"$f":"Nitro_Cooler_Capacity","v":1.6071428571428572},"kW"]
[null,null,null,null,null,null,null,20,{"$f":"I51+1","v":6},{"$f":"MATCH(MaxStrokeLength,I51:I68)","v":13},null,null,2,null,{"$f":"Heat_Factor!T44","v":"Liquid cooling"}]
[null,null,null,null,null,null,null,30,{"$f":"I52+1","v":7},null,null,null,3,null,{"$f":"Heat_Factor!T45","v":"Nitro Cooler"},null,null,null,null,null,"External Cooling Need",{"$f":"IF(V46-W49<0,0,ROUND(V46-W49,2))","v":0},"kW"]
[null,null,null,null,null,null,null,40,8,null,null,null,4,null,null,null,null,null,null,null,"Min External Cooling per spring",{"$f":"V53/User_Number_of_Springs","v":0},"kW"]
[null,null,null,null,null,null,null,50,9,null,{"$f":"COUNT(Used_Stroke_List)","v":13},null,5]
[null,null,null,null,null,null,null,60,10,null,{"$f":"IF(K51>K55,K55,K51)","v":1},null,6]
[null,null,null,null,null,null,null,70,11,null,"User_Used_Strokelength",null,7,null,null,null,null,null,null,null,"Select Cooling Alternative:"]
[null,null,null,null,null,null,null,80,12,null,{"$f":"INDEX(Used_Stroke_List,K56)","v":5},null,8,null,null,null,null,null,null,null,null,{"$f":"Cooler_Message","v":""}]
[null,null,null,null,null,null,null,90,13,null,{"$f":"User_Used_Stroke_Length-Stroke","v":-5},null,9]
[null,null,null,null,null,null,null,100,14,null,null,null,10]
[null,null,null,null,null,null,null,110,15,null,null,null,11]
[null,null,null,null,null,null,null,120,16,null,null,null,12,null,null,null,null,null,null,null,"Note:"]
[null,null,null,null,null,null,null,130,17,null,null,null,13,null,null,null,null,null,null,null,"For some applications, the need for cooling can be eliminated"]
[null,null,null,null,null,null,null,140,18,null,null,null,14,null,null,null,null,null,null,null,"by considering one of the following:"]
[null,null,null,null,null,null,null,150,19,null,{"$f":"Cooling_Needed/User_Number_of_Springs","v":{"$error":"#NAME?"}},null,15,null,null,null,null,null,null,null,"Add more CS2 springs"]
[null,null,null,null,null,null,null,160,{"$f":"I65+1","v":20},null,null,null,16,null,null,null,"Return Speed",null,null,null,"Use larger CS2 springs"]
[null,null,null,null,null,null,null,null,21,null,null,null,null,null,null,null,{"$f":"IF(Cooler=\"-NC\",E25*0.55,E25)","v":0.2}]
[null,null,null,null,null,null,null,null,22,null,"Adjusted stroke",null,null,null,null,null,null,null,null,null,"Important! When using the Nitro Cooler, the return stroke"]
[null,null,null,null,null,null,null,null,null,null,{"$f":"User_Used_Stroke_Length","v":5},null,null,null,null,null,null,null,null,null,"speed of the piston rod decreases by approximately 40% "]
[null,null,null,null,null,null,null,null,null,null,{"$f":"IF(A25=\"Adjustable\",K69,\"\")","v":5}]
[null,null,null,null,null,null,null,null,null,null,{"$f":"TEXT(K70,\"000\")","v":"005"}]
[null,null,null,null,null,null,null,null,null,null,{"$f":"IF(A25=\"Adjustable\",\"-\",\"\")","v":"-"}]
[null,null,null,null,null,null,null,null,null,null,null,null,null,null,null,null,null,null,null,null,"CS Spring Motion"]
[]
[null,null,null,null,null,null,null,null,null,null,null,null,null,null,null,null,null,null,null,null,"Cycle Time",{"$f":"60/User_Strokes_per_Minute","v":6},"s"]
[null,null,null,null,null,null,null,null,null,null,null,null,null,null,null,null,null,null,null,null,"Return Time",{"$f":"User_Used_Stroke_Length/(Return_Speed*1000)","v":2.5000000000000001E-2},"s"]
[null,null,null,null,null,null,null,null,null,null,null,null,null,null,null,null,null,null,null,null,"Return Speed",{"$f":"Return_Speed","v":0.2},"m/s"]
[]
[]
[null,null,null,null,null,null,null,null,null,null,null,null,null,null,null,null,null,null,null,null,"Selection Summary"]
[]
[null,null,null,null,null,null,null,null,null,null,null,null,null,null,null,null,null,null,null,null,"Gas Spring","Order No.",null,"Quantity"]
[null,null,null,null,null,null,null,null,null,null,null,null,null,null,null,null,null,null,null,null,{"$f":"ModelSize","v":"CS2-A 1500"},{"$f":"Description&K72&K71&Heat_Factor!S21","v":"CS2-A 1500-10-005 "},null,{"$f":"User_Number_of_Springs","v":1}]
[]
[null,null,null,null,null,null,null,null,null,null,null,null,null,null,null,null,null,null,null,null,"Cooler","Order No.",null,"Quantity"]
[null,null,null,null,null,null,null,null,null,null,null,null,null,null,null,null,null,null,null,null,{"$f":"Cooler_Selection","v":"No Cooler"},{"$f":"Cooler_OrderNo","v":""},null,{"$f":"Cooler_Quantity","v":""}]
[]
[]
[null,null,null,null,null,null,null,null,null,null,null,null,null,null,null,null,null,null,null,null,"IMPORTANT:"]
[]
[]
[]
[]
[]
[]
[]
[]
[]
[null,null,null,null,null,null,null,null,null,null,null,null,null,null,null,null,null,null,null,null,null,null,null,"Please send feeback and comments to:",null,null,"Orders@hysonsolutions.com"]

{"sheet":"Produkter","index":1,"n_rows":684,"n_cols":16,"rows_kept":684,"cut":false,"hidden":true,"merged":[]}
[null,"Model size",null,"Stroke (mm)","Return Speed","Piston Rod Diameter","Min Gas Pressure (bar)","Max Gas Pressure (bar)","Min Stroke Length","Max Stroke Length","L min","Fi","Fs","Tube_Diameter","Piston Area (dm2)","Description"]
["Adjustable","CS2-A 1500",1500,10,0.2,36,25,150,5,17,142,15000,22000,80,"-","CS2-A 1500-10"]
["Adjustable","CS2-A 1500",1500,20,0.2,36,25,150,12,27,152,15000,22000,80,null,"CS2-A 1500-20"]
["Adjustable","CS2-A 1500",1500,30,0.2,36,25,150,22,37,162,15000,22000,80,null,"CS2-A 1500-30"]
["Adjustable","CS2-A 1500",1500,40,0.2,36,25,150,32,47,172,15000,22000,80,null,"CS2-A 1500-40"]
["Adjustable","CS2-A 1500",1500,50,0.2,36,25,150,42,57,182,15000,22000,80,null,"CS2-A 1500-50"]
["Adjustable","CS2-A 1500",1500,60,0.2,36,25,150,52,67,192,15000,22000,80,null,"CS2-A 1500-60"]
["Adjustable","CS2-A 1500",1500,70,0.2,36,25,150,62,77,202,15000,22000,80,null,"CS2-A 1500-70"]
["Adjustable","CS2-A 1500",1500,80,0.2,36,25,150,72,87,212,15000,22000,80,null,"CS2-A 1500-80"]
["Adjustable","CS2-A 1500",1500,90,0.2,36,25,150,82,97,222,15000,22000,80,null,"CS2-A 1500-90"]
["Adjustable","CS2-A 1500",1500,100,0.2,36,25,150,92,107,232,15000,22000,80,null,"CS2-A 1500-100"]
["Adjustable","CS2-A 1500",1500,110,0.2,36,25,150,102,117,242,15000,22000,80,null,"CS2-A 1500-110"]
["Adjustable","CS2-A 1500",1500,120,0.2,36,25,150,112,127,252,15000,22000,80,null,"CS2-A 1500-120"]
["Adjustable","CS2-A 1500",1500,130,0.2,36,25,150,122,137,262,15000,22000,80,null,"CS2-A 1500-130"]
["Adjustable","CS2-A 1500",1500,140,0.2,36,25,150,132,147,272,15000,22000,80,null,"CS2-A 1500-140"]
["Adjustable","CS2-A 1500",1500,150,0.2,36,25,150,142,157,282,15000,22000,80,null,"CS2-A 1500-150"]
["Adjustable","CS2-A 1500",1500,160,0.2,36,25,150,152,167,292,15000,22000,80,null,"CS2-A 1500-160"]
["Adjustable","CS2-A 3000",3000,10,0.2,50,25,150,6,17,{"$f":"K2+10","v":152},30000,42000,100,null,"CS2-A 3000-10"]
["Adjustable","CS2-A 3000",3000,20,0.2,50,25,150,12,27,{"$f":"K3+10","v":162},30000,42000,100,null,"CS2-A 3000-20"]
["Adjustable","CS2-A 3000",3000,30,0.2,50,25,150,22,37,172,30000,42000,100,null,"CS2-A 3000-30"]
["Adjustable","CS2-A 3000",3000,40,0.2,50,25,150,32,47,182,30000,42000,100,null,"CS2-A 3000-40"]
["Adjustable","CS2-A 3000",3000,50,0.2,50,25,150,42,57,192,30000,42000,100,null,"CS2-A 3000-50"]
["Adjustable","CS2-A 3000",3000,60,0.2,50,25,150,52,67,202,30000,42000,100,null,"CS2-A 3000-60"]
["Adjustable","CS2-A 3000",3000,70,0.2,50,25,150,62,77,212,30000,42000,100,null,"CS2-A 3000-70"]
["Adjustable","CS2-A 3000",3000,80,0.2,50,25,150,72,87,222,30000,42000,100,null,"CS2-A 3000-80"]
["Adjustable","CS2-A 3000",3000,90,0.2,50,25,150,82,97,232,30000,42000,100,null,"CS2-A 3000-90"]
["Adjustable","CS2-A 3000",3000,100,0.2,50,25,150,92,107,242,30000,42000,100,null,"CS2-A 3000-100"]
["Adjustable","CS2-A 3000",3000,110,0.2,50,25,150,102,117,252,30000,42000,100,null,"CS2-A 3000-110"]
["Adjustable","CS2-A 3000",3000,120,0.2,50,25,150,112,127,262,30000,42000,100,null,"CS2-A 3000-120"]
["Adjustable","CS2-A 3000",3000,130,0.2,50,25,150,122,137,272,30000,42000,100,null,"CS2-A 3000-130"]
["Adjustable","CS2-A 3000",3000,140,0.2,50,25,150,132,147,282,30000,42000,100,null,"CS2-A 3000-140"]
["Adjustable","CS2-A 3000",3000,150,0.2,50,25,150,142,157,292,30000,42000,100,null,"CS2-A 3000-150"]
["Adjustable","CS2-A 3000",3000,160,0.2,50,25,150,152,167,302,30000,42000,100,null,"CS2-A 3000-160"]
["Adjustable","CS2-A 5000",5000,10,{"$f":"AVERAGE(0.15,0.12)","v":0.13500000000000001},65,25,150,6,17,{"$f":"K18+25","v":177},50000,74000,125,null,"CS2-A 5000-10"]
["Adjustable","CS2-A 5000",5000,20,{"$f":"AVERAGE(0.15,0.12)","v":0.13500000000000001},65,25,150,12,27,{"$f":"K19+25","v":187},50000,74000,125,null,"CS2-A 5000-20"]
["Adjustable","CS2-A 5000",5000,30,0.13500000000000001,65,25,150,22,37,197,50000,74000,125,null,"CS2-A 5000-30"]
["Adjustable","CS2-A 5000",5000,40,0.13500000000000001,65,25,150,32,47,207,50000,74000,125,null,"CS2-A 5000-40"]
["Adjustable","CS2-A 5000",5000,50,0.13500000000000001,65,25,150,42,57,217,50000,74000,125,null,"CS2-A 5000-50"]
["Adjustable","CS2-A 5000",5000,60,0.13500000000000001,65,25,150,52,67,227,50000,74000,125,null,"CS2-A 5000-60"]
["Adjustable","CS2-A 5000",5000,70,0.13500000000000001,65,25,150,62,77,237,50000,74000,125,null,"CS2-A 5000-70"]
["Adjustable","CS2-A 5000",5000,80,0.13500000000000001,65,25,150,72,87,247,50000,74000,125,null,"CS2-A 5000-80"]
["Adjustable","CS2-A 5000",5000,90,0.13500000000000001,65,25,150,82,97,257,50000,74000,125,null,"CS2-A 5000-90"]
["Adjustable","CS2-A 5000",5000,100,0.13500000000000001,65,25,150,92,107,267,50000,74000,125,null,"CS2-A 5000-100"]
["Adjustable","CS2-A 5000",5000,110,0.13500000000000001,65,25,150,102,117,277,50000,74000,125,null,"CS2-A 5000-110"]
["Adjustable","CS2-A 5000",5000,120,0.13500000000000001,65,25,150,112,127,287,50000,74000,125,null,"CS2-A 5000-120"]
["Adjustable","CS2-A 5000",5000,130,0.13500000000000001,65,25,150,122,137,297,50000,74000,125,null,"CS2-A 5000-130"]
["Adjustable","CS2-A 5000",5000,140,0.13500000000000001,65,25,150,132,147,307,50000,74000,125,null,"CS2-A 5000-140"]
["Adjustable","CS2-A 5000",5000,150,0.13500000000000001,65,25,150,142,157,317,50000,74000,125,null,"CS2-A 5000-150"]
["Adjustable","CS2-A 5000",5000,160,0.13500000000000001,65,25,150,152,167,327,50000,74000,125,null,"CS2-A 5000-160"]
["Adjustable","CS2-A 7500",7500,10,{"$f":"AVERAGE(0.13,0.08)","v":0.10500000000000001},80,25,150,8,17,{"$f":"K34+20","v":197},75000,98000,160,null,"CS2-A 7500-10"]
["Adjustable","CS2-A 7500",7500,20,{"$f":"AVERAGE(0.13,0.08)","v":0.10500000000000001},80,25,150,12,27,{"$f":"K35+20","v":207},75000,98000,160,null,"CS2-A 7500-20"]
["Adjustable","CS2-A 7500",7500,30,0.10500000000000001,80,25,150,22,37,217,75000,98000,160,null,"CS2-A 7500-30"]
["Adjustable","CS2-A 7500",7500,40,0.10500000000000001,80,25,150,32,47,227,75000,98000,160,null,"CS2-A 7500-40"]
["Adjustable","CS2-A 7500",7500,50,0.10500000000000001,80,25,150,42,57,237,75000,98000,160,null,"CS2-A 7500-50"]
["Adjustable","CS2-A 7500",7500,60,0.10500000000000001,80,25,150,52,67,247,75000,98000,160,null,"CS2-A 7500-60"]
["Adjustable","CS2-A 7500",7500,70,0.10500000000000001,80,25,150,62,77,257,75000,98000,160,null,"CS2-A 7500-70"]
["Adjustable","CS2-A 7500",7500,80,0.10500000000000001,80,25,150,72,87,267,75000,98000,160,null,"CS2-A 7500-80"]
["Adjustable","CS2-A 7500",7500,90,0.10500000000000001,80,25,150,82,97,277,75000,98000,160,null,"CS2-A 7500-90"]
["Adjustable","CS2-A 7500",7500,100,0.10500000000000001,80,25,150,92,107,287,75000,98000,160,null,"CS2-A 7500-100"]
["Adjustable","CS2-A 7500",7500,110,0.10500000000000001,80,25,150,102,117,297,75000,98000,160,null,"CS2-A 7500-110"]
["Adjustable","CS2-A 7500",7500,120,0.10500000000000001,80,25,150,112,127,307,75000,98000,160,null,"CS2-A 7500-120"]
["Adjustable","CS2-A 7500",7500,130,0.10500000000000001,80,25,150,122,137,317,75000,98000,160,null,"CS2-A 7500-130"]
["Adjustable","CS2-A 7500",7500,140,0.10500000000000001,80,25,150,132,147,327,75000,98000,160,null,"CS2-A 7500-140"]
["Adjustable","CS2-A 7500",7500,150,0.10500000000000001,80,25,150,142,157,337,75000,98000,160,null,"CS2-A 7500-150"]
["Adjustable","CS2-A 7500",7500,160,0.10500000000000001,80,25,150,152,167,347,75000,98000,160,null,"CS2-A 7500-160"]
["Non Adjustable","CS2 1500",1500,5,0.2,36,25,150,{"$f":"D66","v":5},{"$f":"D66","v":5},{"$f":"125+D66","v":130},15000,22000,80,null,"CS2 1500-05"]
["Non Adjustable","CS2 1500",1500,6,0.2,36,25,150,6,6,131,15000,22000,80,null,"CS2 1500-06"]
["Non Adjustable","CS2 1500",1500,7,0.2,36,25,150,7,7,132,15000,22000,80,null,"CS2 1500-07"]
["Non Adjustable","CS2 1500",1500,8,0.2,36,25,150,8,8,133,15000,22000,80,null,"CS2 1500-08"]
["Non Adjustable","CS2 1500",1500,9,0.2,36,25,150,9,9,134,15000,22000,80,null,"CS2 1500-09"]
["Non Adjustable","CS2 1500",1500,10,0.2,36,25,150,{"$f":"D71","v":10},{"$f":"D71","v":10},{"$f":"125+D71","v":135},15000,22000,80,null,"CS2 1500-10"]
["Non Adjustable","CS2 1500",1500,11,0.2,36,25,150,{"$f":"D72","v":11},{"$f":"D72","v":11},{"$f":"125+D72","v":136},15000,22000,80,null,"CS2 1500-11"]
["Non Adjustable","CS2 1500",1500,12,0.2,36,25,150,12,12,137,15000,22000,80,null,"CS2 1500-12"]
["Non Adjustable","CS2 1500",1500,13,0.2,36,25,150,13,13,138,15000,22000,80,null,"CS2 1500-13"]
["Non Adjustable","CS2 1500",1500,14,0.2,36,25,150,14,14,139,15000,22000,80,null,"CS2 1500-14"]
["Non Adjustable","CS2 1500",1500,15,0.2,36,25,150,15,15,140,15000,22000,80,null,"CS2 1500-15"]
["Non Adjustable","CS2 1500",1500,16,0.2,36,25,150,16,16,141,15000,22000,80,null,"CS2 1500-16"]
["Non Adjustable","CS2 1500",1500,17,0.2,36,25,150,17,17,142,15000,22000,80,null,"CS2 1500-17"]
["Non Adjustable","CS2 1500",1500,18,0.2,36,25,150,18,18,143,15000,22000,80,null,"CS2 1500-18"]
["Non Adjustable","CS2 1500",1500,19,0.2,36,25,150,19,19,144,15000,22000,80,null,"CS2 1500-19"]
["Non Adjustable","CS2 1500",1500,20,0.2,36,25,150,20,20,145,15000,22000,80,null,"CS2 1500-20"]
["Non Adjustable","CS2 1500",1500,21,0.2,36,25,150,21,21,146,15000,22000,80,null,"CS2 1500-21"]
["Non Adjustable","CS2 1500",1500,22,0.2,36,25,150,22,22,147,15000,22000,80,null,"CS2 1500-22"]
["Non Adjustable","CS2 1500",1500,23,0.2,36,25,150,23,23,148,15000,22000,80,null,"CS2 1500-23"]
["Non Adjustable","CS2 1500",1500,24,0.2,36,25,150,24,24,149,15000,22000,80,null,"CS2 1500-24"]
["Non Adjustable","CS2 1500",1500,25,0.2,36,25,150,25,25,150,15000,22000,80,null,"CS2 1500-25"]
["Non Adjustable","CS2 1500",1500,26,0.2,36,25,150,26,26,151,15000,22000,80,null,"CS2 1500-26"]
["Non Adjustable","CS2 1500",1500,27,0.2,36,25,150,27,27,152,15000,22000,80,null,"CS2 1500-27"]
["Non Adjustable","CS2 1500",1500,28,0.2,36,25,150,28,28,153,15000,22000,80,null,"CS2 1500-28"]
["Non Adjustable","CS2 1500",1500,29,0.2,36,25,150,29,29,154,15000,22000,80,null,"CS2 1500-29"]
["Non Adjustable","CS2 1500",1500,30,0.2,36,25,150,30,30,155,15000,22000,80,null,"CS2 1500-30"]
["Non Adjustable","CS2 1500",1500,31,0.2,36,25,150,31,31,156,15000,22000,80,null,"CS2 1500-31"]
["Non Adjustable","CS2 1500",1500,32,0.2,36,25,150,32,32,157,15000,22000,80,null,"CS2 1500-32"]
["Non Adjustable","CS2 1500",1500,33,0.2,36,25,150,33,33,158,15000,22000,80,null,"CS2 1500-33"]
["Non Adjustable","CS2 1500",1500,34,0.2,36,25,150,34,34,159,15000,22000,80,null,"CS2 1500-34"]
["Non Adjustable","CS2 1500",1500,35,0.2,36,25,150,35,35,160,15000,22000,80,null,"CS2 1500-35"]
["Non Adjustable","CS2 1500",1500,36,0.2,36,25,150,36,36,161,15000,22000,80,null,"CS2 1500-36"]
["Non Adjustable","CS2 1500",1500,37,0.2,36,25,150,37,37,162,15000,22000,80,null,"CS2 1500-37"]
["Non Adjustable","CS2 1500",1500,38,0.2,36,25,150,38,38,163,15000,22000,80,null,"CS2 1500-38"]
["Non Adjustable","CS2 1500",1500,39,0.2,36,25,150,39,39,164,15000,22000,80,null,"CS2 1500-39"]
["Non Adjustable","CS2 1500",1500,40,0.2,36,25,150,40,40,165,15000,22000,80,null,"CS2 1500-40"]
["Non Adjustable","CS2 1500",1500,41,0.2,36,25,150,41,41,166,15000,22000,80,null,"CS2 1500-41"]
["Non Adjustable","CS2 1500",1500,42,0.2,36,25,150,42,42,167,15000,22000,80,null,"CS2 1500-42"]
["Non Adjustable","CS2 1500",1500,43,0.2,36,25,150,43,43,168,15000,22000,80,null,"CS2 1500-43"]
["Non Adjustable","CS2 1500",1500,44,0.2,36,25,150,44,44,169,15000,22000,80,null,"CS2 1500-44"]
["Non Adjustable","CS2 1500",1500,45,0.2,36,25,150,45,45,170,15000,22000,80,null,"CS2 1500-45"]
["Non Adjustable","CS2 1500",1500,46,0.2,36,25,150,46,46,171,15000,22000,80,null,"CS2 1500-46"]
["Non Adjustable","CS2 1500",1500,47,0.2,36,25,150,47,47,172,15000,22000,80,null,"CS2 1500-47"]
["Non Adjustable","CS2 1500",1500,48,0.2,36,25,150,48,48,173,15000,22000,80,null,"CS2 1500-48"]
["Non Adjustable","CS2 1500",1500,49,0.2,36,25,150,49,49,174,15000,22000,80,null,"CS2 1500-49"]
["Non Adjustable","CS2 1500",1500,50,0.2,36,25,150,50,50,175,15000,22000,80,null,"CS2 1500-50"]
["Non Adjustable","CS2 1500",1500,51,0.2,36,25,150,51,51,176,15000,22000,80,null,"CS2 1500-51"]
["Non Adjustable","CS2 1500",1500,52,0.2,36,25,150,52,52,177,15000,22000,80,null,"CS2 1500-52"]
["Non Adjustable","CS2 1500",1500,53,0.2,36,25,150,53,53,178,15000,22000,80,null,"CS2 1500-53"]
["Non Adjustable","CS2 1500",1500,54,0.2,36,25,150,54,54,179,15000,22000,80,null,"CS2 1500-54"]
["Non Adjustable","CS2 1500",1500,55,0.2,36,25,150,55,55,180,15000,22000,80,null,"CS2 1500-55"]
["Non Adjustable","CS2 1500",1500,56,0.2,36,25,150,56,56,181,15000,22000,80,null,"CS2 1500-56"]
["Non Adjustable","CS2 1500",1500,57,0.2,36,25,150,57,57,182,15000,22000,80,null,"CS2 1500-57"]
["Non Adjustable","CS2 1500",1500,58,0.2,36,25,150,58,58,183,15000,22000,80,null,"CS2 1500-58"]
["Non Adjustable","CS2 1500",1500,59,0.2,36,25,150,59,59,184,15000,22000,80,null,"CS2 1500-59"]
["Non Adjustable","CS2 1500",1500,60,0.2,36,25,150,60,60,185,15000,22000,80,null,"CS2 1500-60"]
["Non Adjustable","CS2 1500",1500,61,0.2,36,25,150,61,61,186,15000,22000,80,null,"CS2 1500-61"]
["Non Adjustable","CS2 1500",1500,62,0.2,36,25,150,62,62,187,15000,22000,80,null,"CS2 1500-62"]
["Non Adjustable","CS2 1500",1500,63,0.2,36,25,150,63,63,188,15000,22000,80,null,"CS2 1500-63"]
["Non Adjustable","CS2 1500",1500,64,0.2,36,25,150,64,64,189,15000,22000,80,null,"CS2 1500-64"]
["Non Adjustable","CS2 1500",1500,65,0.2,36,25,150,65,65,190,15000,22000,80,null,"CS2 1500-65"]
["Non Adjustable","CS2 1500",1500,66,0.2,36,25,150,66,66,191,15000,22000,80,null,"CS2 1500-66"]
["Non Adjustable","CS2 1500",1500,67,0.2,36,25,150,67,67,192,15000,22000,80,null,"CS2 1500-67"]
["Non Adjustable","CS2 1500",1500,68,0.2,36,25,150,68,68,193,15000,22000,80,null,"CS2 1500-68"]
["Non Adjustable","CS2 1500",1500,69,0.2,36,25,150,69,69,194,15000,22000,80,null,"CS2 1500-69"]
["Non Adjustable","CS2 1500",1500,70,0.2,36,25,150,70,70,195,15000,22000,80,null,"CS2 1500-70"]
["Non Adjustable","CS2 1500",1500,71,0.2,36,25,150,71,71,196,15000,22000,80,null,"CS2 1500-71"]
["Non Adjustable","CS2 1500",1500,72,0.2,36,25,150,72,72,197,15000,22000,80,null,"CS2 1500-72"]
["Non Adjustable","CS2 1500",1500,73,0.2,36,25,150,73,73,198,15000,22000,80,null,"CS2 1500-73"]
["Non Adjustable","CS2 1500",1500,74,0.2,36,25,150,74,74,199,15000,22000,80,null,"CS2 1500-74"]
["Non Adjustable","CS2 1500",1500,75,0.2,36,25,150,{"$f":"D136","v":75},{"$f":"D136","v":75},{"$f":"125+D136","v":200},15000,22000,80,null,"CS2 1500-75"]
["Non Adjustable","CS2 1500",1500,76,0.2,36,25,150,76,76,201,15000,22000,80,null,"CS2 1500-76"]
["Non Adjustable","CS2 1500",1500,77,0.2,36,25,150,77,77,202,15000,22000,80,null,"CS2 1500-77"]
["Non Adjustable","CS2 1500",1500,78,0.2,36,25,150,78,78,203,15000,22000,80,null,"CS2 1500-78"]
["Non Adjustable","CS2 1500",1500,79,0.2,36,25,150,79,79,204,15000,22000,80,null,"CS2 1500-79"]
["Non Adjustable","CS2 1500",1500,80,0.2,36,25,150,80,80,205,15000,22000,80,null,"CS2 1500-80"]
["Non Adjustable","CS2 1500",1500,81,0.2,36,25,150,81,81,206,15000,22000,80,null,"CS2 1500-81"]
["Non Adjustable","CS2 1500",1500,82,0.2,36,25,150,82,82,207,15000,22000,80,null,"CS2 1500-82"]
["Non Adjustable","CS2 1500",1500,83,0.2,36,25,150,83,83,208,15000,22000,80,null,"CS2 1500-83"]
["Non Adjustable","CS2 1500",1500,84,0.2,36,25,150,84,84,209,15000,22000,80,null,"CS2 1500-84"]
["Non Adjustable","CS2 1500",1500,85,0.2,36,25,150,85,85,210,15000,22000,80,null,"CS2 1500-85"]
["Non Adjustable","CS2 1500",1500,86,0.2,36,25,150,86,86,211,15000,22000,80,null,"CS2 1500-86"]
["Non Adjustable","CS2 1500",1500,87,0.2,36,25,150,87,87,212,15000,22000,80,null,"CS2 1500-87"]
["Non Adjustable","CS2 1500",1500,88,0.2,36,25,150,88,88,213,15000,22000,80,null,"CS2 1500-88"]
["Non Adjustable","CS2 1500",1500,89,0.2,36,25,150,89,89,214,15000,22000,80,null,"CS2 1500-89"]
["Non Adjustable","CS2 1500",1500,90,0.2,36,25,150,90,90,215,15000,22000,80,null,"CS2 1500-90"]
["Non Adjustable","CS2 1500",1500,91,0.2,36,25,150,91,91,216,15000,22000,80,null,"CS2 1500-91"]
["Non Adjustable","CS2 1500",1500,92,0.2,36,25,150,92,92,217,15000,22000,80,null,"CS2 1500-92"]
["Non Adjustable","CS2 1500",1500,93,0.2,36,25,150,93,93,218,15000,22000,80,null,"CS2 1500-93"]
["Non Adjustable","CS2 1500",1500,94,0.2,36,25,150,94,94,219,15000,22000,80,null,"CS2 1500-94"]
["Non Adjustable","CS2 1500",1500,95,0.2,36,25,150,95,95,220,15000,22000,80,null,"CS2 1500-95"]
["Non Adjustable","CS2 1500",1500,96,0.2,36,25,150,96,96,221,15000,22000,80,null,"CS2 1500-96"]
["Non Adjustable","CS2 1500",1500,97,0.2,36,25,150,97,97,222,15000,22000,80,null,"CS2 1500-97"]
["Non Adjustable","CS2 1500",1500,98,0.2,36,25,150,98,98,223,15000,22000,80,null,"CS2 1500-98"]
["Non Adjustable","CS2 1500",1500,99,0.2,36,25,150,99,99,224,15000,22000,80,null,"CS2 1500-99"]
["Non Adjustable","CS2 1500",1500,100,0.2,36,25,150,100,100,225,15000,22000,80,null,"CS2 1500-100"]
["Non Adjustable","CS2 1500",1500,101,0.2,36,25,150,101,101,226,15000,22000,80,null,"CS2 1500-101"]
["Non Adjustable","CS2 1500",1500,102,0.2,36,25,150,102,102,227,15000,22000,80,null,"CS2 1500-102"]
["Non Adjustable","CS2 1500",1500,103,0.2,36,25,150,103,103,228,15000,22000,80,null,"CS2 1500-103"]
["Non Adjustable","CS2 1500",1500,104,0.2,36,25,150,104,104,229,15000,22000,80,null,"CS2 1500-104"]
["Non Adjustable","CS2 1500",1500,105,0.2,36,25,150,105,105,230,15000,22000,80,null,"CS2 1500-105"]
["Non Adjustable","CS2 1500",1500,106,0.2,36,25,150,106,106,231,15000,22000,80,null,"CS2 1500-106"]
["Non Adjustable","CS2 1500",1500,107,0.2,36,25,150,107,107,232,15000,22000,80,null,"CS2 1500-107"]
["Non Adjustable","CS2 1500",1500,108,0.2,36,25,150,108,108,233,15000,22000,80,null,"CS2 1500-108"]
["Non Adjustable","CS2 1500",1500,109,0.2,36,25,150,109,109,234,15000,22000,80,null,"CS2 1500-109"]
["Non Adjustable","CS2 1500",1500,110,0.2,36,25,150,110,110,235,15000,22000,80,null,"CS2 1500-110"]
["Non Adjustable","CS2 1500",1500,111,0.2,36,25,150,111,111,236,15000,22000,80,null,"CS2 1500-111"]
["Non Adjustable","CS2 1500",1500,112,0.2,36,25,150,112,112,237,15000,22000,80,null,"CS2 1500-112"]
["Non Adjustable","CS2 1500",1500,113,0.2,36,25,150,113,113,238,15000,22000,80,null,"CS2 1500-113"]
["Non Adjustable","CS2 1500",1500,114,0.2,36,25,150,114,114,239,15000,22000,80,null,"CS2 1500-114"]
["Non Adjustable","CS2 1500",1500,115,0.2,36,25,150,115,115,240,15000,22000,80,null,"CS2 1500-115"]
["Non Adjustable","CS2 1500",1500,116,0.2,36,25,150,116,116,241,15000,22000,80,null,"CS2 1500-116"]
["Non Adjustable","CS2 1500",1500,117,0.2,36,25,150,117,117,242,15000,22000,80,null,"CS2 1500-117"]
["Non Adjustable","CS2 1500",1500,118,0.2,36,25,150,118,118,243,15000,22000,80,null,"CS2 1500-118"]
["Non Adjustable","CS2 1500",1500,119,0.2,36,25,150,119,119,244,15000,22000,80,null,"CS2 1500-119"]
["Non Adjustable","CS2 1500",1500,120,0.2,36,25,150,120,120,245,15000,22000,80,null,"CS2 1500-120"]
["Non Adjustable","CS2 1500",1500,121,0.2,36,25,150,121,121,246,15000,22000,80,null,"CS2 1500-121"]
["Non Adjustable","CS2 1500",1500,122,0.2,36,25,150,122,122,247,15000,22000,80,null,"CS2 1500-122"]
["Non Adjustable","CS2 1500",1500,123,0.2,36,25,150,123,123,248,15000,22000,80,null,"CS2 1500-123"]
["Non Adjustable","CS2 1500",1500,124,0.2,36,25,150,124,124,249,15000,22000,80,null,"CS2 1500-124"]
["Non Adjustable","CS2 1500",1500,125,0.2,36,25,150,125,125,250,15000,22000,80,null,"CS2 1500-125"]
["Non Adjustable","CS2 1500",1500,126,0.2,36,25,150,126,126,251,15000,22000,80,null,"CS2 1500-126"]
["Non Adjustable","CS2 1500",1500,127,0.2,36,25,150,127,127,252,15000,22000,80,null,"CS2 1500-127"]
["Non Adjustable","CS2 1500",1500,128,0.2,36,25,150,128,128,253,15000,22000,80,null,"CS2 1500-128"]
["Non Adjustable","CS2 1500",1500,129,0.2,36,25,150,129,129,254,15000,22000,80,null,"CS2 1500-129"]
["Non Adjustable","CS2 1500",1500,130,0.2,36,25,150,130,130,255,15000,22000,80,null,"CS2 1500-130"]
["Non Adjustable","CS2 1500",1500,131,0.2,36,25,150,131,131,256,15000,22000,80,null,"CS2 1500-131"]
["Non Adjustable","CS2 1500",1500,132,0.2,36,25,150,132,132,257,15000,22000,80,null,"CS2 1500-132"]
["Non Adjustable","CS2 1500",1500,133,0.2,36,25,150,133,133,258,15000,22000,80,null,"CS2 1500-133"]
["Non Adjustable","CS2 1500",1500,134,0.2,36,25,150,134,134,259,15000,22000,80,null,"CS2 1500-134"]
["Non Adjustable","CS2 1500",1500,135,0.2,36,25,150,135,135,260,15000,22000,80,null,"CS2 1500-135"]
["Non Adjustable","CS2 1500",1500,136,0.2,36,25,150,136,136,261,15000,22000,80,null,"CS2 1500-136"]
["Non Adjustable","CS2 1500",1500,137,0.2,36,25,150,137,137,262,15000,22000,80,null,"CS2 1500-137"]
["Non Adjustable","CS2 1500",1500,138,0.2,36,25,150,138,138,263,15000,22000,80,null,"CS2 1500-138"]
["Non Adjustable","CS2 1500",1500,139,0.2,36,25,150,{"$f":"D200","v":139},{"$f":"D200","v":139},{"$f":"125+D200","v":264},15000,22000,80,null,"CS2 1500-139"]
["Non Adjustable","CS2 1500",1500,140,0.2,36,25,150,140,140,265,15000,22000,80,null,"CS2 1500-140"]
["Non Adjustable","CS2 1500",1500,141,0.2,36,25,150,141,141,266,15000,22000,80,null,"CS2 1500-141"]
["Non Adjustable","CS2 1500",1500,142,0.2,36,25,150,142,142,267,15000,22000,80,null,"CS2 1500-142"]
["Non Adjustable","CS2 1500",1500,143,0.2,36,25,150,143,143,268,15000,22000,80,null,"CS2 1500-143"]
["Non Adjustable","CS2 1500",1500,144,0.2,36,25,150,144,144,269,15000,22000,80,null,"CS2 1500-144"]
["Non Adjustable","CS2 1500",1500,145,0.2,36,25,150,145,145,270,15000,22000,80,null,"CS2 1500-145"]
["Non Adjustable","CS2 1500",1500,146,0.2,36,25,150,146,146,271,15000,22000,80,null,"CS2 1500-146"]
["Non Adjustable","CS2 1500",1500,147,0.2,36,25,150,147,147,272,15000,22000,80,null,"CS2 1500-147"]
["Non Adjustable","CS2 1500",1500,148,0.2,36,25,150,148,148,273,15000,22000,80,null,"CS2 1500-148"]
["Non Adjustable","CS2 1500",1500,149,0.2,36,25,150,149,149,274,15000,22000,80,null,"CS2 1500-149"]
["Non Adjustable","CS2 1500",1500,150,0.2,36,25,150,150,150,275,15000,22000,80,null,"CS2 1500-150"]
["Non Adjustable","CS2 1500",1500,151,0.2,36,25,150,151,151,276,15000,22000,80,null,"CS2 1500-151"]
["Non Adjustable","CS2 1500",1500,152,0.2,36,25,150,152,152,277,15000,22000,80,null,"CS2 1500-152"]
["Non Adjustable","CS2 1500",1500,153,0.2,36,25,150,153,153,278,15000,22000,80,null,"CS2 1500-153"]
["Non Adjustable","CS2 1500",1500,154,0.2,36,25,150,154,154,279,15000,22000,80,null,"CS2 1500-154"]
["Non Adjustable","CS2 1500",1500,155,0.2,36,25,150,155,155,280,15000,22000,80,null,"CS2 1500-155"]
["Non Adjustable","CS2 1500",1500,156,0.2,36,25,150,156,156,281,15000,22000,80,null,"CS2 1500-156"]
["Non Adjustable","CS2 1500",1500,157,0.2,36,25,150,157,157,282,15000,22000,80,null,"CS2 1500-157"]
["Non Adjustable","CS2 1500",1500,158,0.2,36,25,150,158,158,283,15000,22000,80,null,"CS2 1500-158"]
["Non Adjustable","CS2 1500",1500,159,0.2,36,25,150,159,159,284,15000,22000,80,null,"CS2 1500-159"]
["Non Adjustable","CS2 1500",1500,160,0.2,36,25,150,160,160,285,15000,22000,80,null,"CS2 1500-160"]
["Non Adjustable","CS2 3000",3000,6,0.2,50,25,150,6,6,{"$f":"135+D222","v":141},30000,42000,100,null,"CS2 3000-06"]
["Non Adjustable","CS2 3000",3000,7,0.2,50,25,150,7,7,142,30000,42000,100,null,"CS2 3000-07"]
["Non Adjustable","CS2 3000",3000,8,0.2,50,25,150,8,8,143,30000,42000,100,null,"CS2 3000-08"]
["Non Adjustable","CS2 3000",3000,9,0.2,50,25,150,9,9,144,30000,42000,100,null,"CS2 3000-09"]
["Non Adjustable","CS2 3000",3000,10,0.2,50,25,150,10,10,{"$f":"135+D226","v":145},30000,42000,100,null,"CS2 3000-10"]
["Non Adjustable","CS2 3000",3000,11,0.2,50,25,150,11,11,{"$f":"135+D227","v":146},30000,42000,100,null,"CS2 3000-11"]
["Non Adjustable","CS2 3000",3000,12,0.2,50,25,150,12,12,147,30000,42000,100,null,"CS2 3000-12"]
["Non Adjustable","CS2 3000",3000,13,0.2,50,25,150,13,13,148,30000,42000,100,null,"CS2 3000-13"]
["Non Adjustable","CS2 3000",3000,14,0.2,50,25,150,14,14,149,30000,42000,100,null,"CS2 3000-14"]
["Non Adjustable","CS2 3000",3000,15,0.2,50,25,150,15,15,150,30000,42000,100,null,"CS2 3000-15"]
["Non Adjustable","CS2 3000",3000,16,0.2,50,25,150,16,16,151,30000,42000,100,null,"CS2 3000-16"]
["Non Adjustable","CS2 3000",3000,17,0.2,50,25,150,17,17,152,30000,42000,100,null,"CS2 3000-17"]
["Non Adjustable","CS2 3000",3000,18,0.2,50,25,150,18,18,153,30000,42000,100,null,"CS2 3000-18"]
["Non Adjustable","CS2 3000",3000,19,0.2,50,25,150,19,19,154,30000,42000,100,null,"CS2 3000-19"]
["Non Adjustable","CS2 3000",3000,20,0.2,50,25,150,20,20,155,30000,42000,100,null,"CS2 3000-20"]
["Non Adjustable","CS2 3000",3000,21,0.2,50,25,150,21,21,156,30000,42000,100,null,"CS2 3000-21"]
["Non Adjustable","CS2 3000",3000,22,0.2,50,25,150,22,22,157,30000,42000,100,null,"CS2 3000-22"]
["Non Adjustable","CS2 3000",3000,23,0.2,50,25,150,23,23,158,30000,42000,100,null,"CS2 3000-23"]
["Non Adjustable","CS2 3000",3000,24,0.2,50,25,150,24,24,159,30000,42000,100,null,"CS2 3000-24"]
["Non Adjustable","CS2 3000",3000,25,0.2,50,25,150,25,25,160,30000,42000,100,null,"CS2 3000-25"]
["Non Adjustable","CS2 3000",3000,26,0.2,50,25,150,26,26,161,30000,42000,100,null,"CS2 3000-26"]
["Non Adjustable","CS2 3000",3000,27,0.2,50,25,150,27,27,162,30000,42000,100,null,"CS2 3000-27"]
["Non Adjustable","CS2 3000",3000,28,0.2,50,25,150,28,28,163,30000,42000,100,null,"CS2 3000-28"]
["Non Adjustable","CS2 3000",3000,29,0.2,50,25,150,29,29,164,30000,42000,100,null,"CS2 3000-29"]
["Non Adjustable","CS2 3000",3000,30,0.2,50,25,150,30,30,165,30000,42000,100,null,"CS2 3000-30"]
["Non Adjustable","CS2 3000",3000,31,0.2,50,25,150,31,31,166,30000,42000,100,null,"CS2 3000-31"]
["Non Adjustable","CS2 3000",3000,32,0.2,50,25,150,32,32,167,30000,42000,100,null,"CS2 3000-32"]
["Non Adjustable","CS2 3000",3000,33,0.2,50,25,150,33,33,168,30000,42000,100,null,"CS2 3000-33"]
["Non Adjustable","CS2 3000",3000,34,0.2,50,25,150,34,34,169,30000,42000,100,null,"CS2 3000-34"]
["Non Adjustable","CS2 3000",3000,35,0.2,50,25,150,35,35,170,30000,42000,100,null,"CS2 3000-35"]
["Non Adjustable","CS2 3000",3000,36,0.2,50,25,150,36,36,171,30000,42000,100,null,"CS2 3000-36"]
["Non Adjustable","CS2 3000",3000,37,0.2,50,25,150,37,37,172,30000,42000,100,null,"CS2 3000-37"]
["Non Adjustable","CS2 3000",3000,38,0.2,50,25,150,38,38,173,30000,42000,100,null,"CS2 3000-38"]
["Non Adjustable","CS2 3000",3000,39,0.2,50,25,150,39,39,174,30000,42000,100,null,"CS2 3000-39"]
["Non Adjustable","CS2 3000",3000,40,0.2,50,25,150,40,40,175,30000,42000,100,null,"CS2 3000-40"]
["Non Adjustable","CS2 3000",3000,41,0.2,50,25,150,41,41,176,30000,42000,100,null,"CS2 3000-41"]
["Non Adjustable","CS2 3000",3000,42,0.2,50,25,150,42,42,177,30000,42000,100,null,"CS2 3000-42"]
["Non Adjustable","CS2 3000",3000,43,0.2,50,25,150,43,43,178,30000,42000,100,null,"CS2 3000-43"]
["Non Adjustable","CS2 3000",3000,44,0.2,50,25,150,44,44,179,30000,42000,100,null,"CS2 3000-44"]
["Non Adjustable","CS2 3000",3000,45,0.2,50,25,150,45,45,180,30000,42000,100,null,"CS2 3000-45"]
["Non Adjustable","CS2 3000",3000,46,0.2,50,25,150,46,46,181,30000,42000,100,null,"CS2 3000-46"]
["Non Adjustable","CS2 3000",3000,47,0.2,50,25,150,47,47,182,30000,42000,100,null,"CS2 3000-47"]
["Non Adjustable","CS2 3000",3000,48,0.2,50,25,150,48,48,183,30000,42000,100,null,"CS2 3000-48"]
["Non Adjustable","CS2 3000",3000,49,0.2,50,25,150,49,49,184,30000,42000,100,null,"CS2 3000-49"]
["Non Adjustable","CS2 3000",3000,50,0.2,50,25,150,50,50,185,30000,42000,100,null,"CS2 3000-50"]
["Non Adjustable","CS2 3000",3000,51,0.2,50,25,150,51,51,186,30000,42000,100,null,"CS2 3000-51"]
["Non Adjustable","CS2 3000",3000,52,0.2,50,25,150,{"$f":"D268","v":52},{"$f":"D268","v":52},187,30000,42000,100,null,"CS2 3000-52"]
["Non Adjustable","CS2 3000",3000,53,0.2,50,25,150,53,53,188,30000,42000,100,null,"CS2 3000-53"]
["Non Adjustable","CS2 3000",3000,54,0.2,50,25,150,54,54,189,30000,42000,100,null,"CS2 3000-54"]
["Non Adjustable","CS2 3000",3000,55,0.2,50,25,150,55,55,190,30000,42000,100,null,"CS2 3000-55"]
["Non Adjustable","CS2 3000",3000,56,0.2,50,25,150,56,56,191,30000,42000,100,null,"CS2 3000-56"]
["Non Adjustable","CS2 3000",3000,57,0.2,50,25,150,57,57,192,30000,42000,100,null,"CS2 3000-57"]
["Non Adjustable","CS2 3000",3000,58,0.2,50,25,150,58,58,193,30000,42000,100,null,"CS2 3000-58"]
["Non Adjustable","CS2 3000",3000,59,0.2,50,25,150,59,59,194,30000,42000,100,null,"CS2 3000-59"]
["Non Adjustable","CS2 3000",3000,60,0.2,50,25,150,60,60,195,30000,42000,100,null,"CS2 3000-60"]
["Non Adjustable","CS2 3000",3000,61,0.2,50,25,150,61,61,196,30000,42000,100,null,"CS2 3000-61"]
["Non Adjustable","CS2 3000",3000,62,0.2,50,25,150,62,62,197,30000,42000,100,null,"CS2 3000-62"]
["Non Adjustable","CS2 3000",3000,63,0.2,50,25,150,63,63,198,30000,42000,100,null,"CS2 3000-63"]
["Non Adjustable","CS2 3000",3000,64,0.2,50,25,150,64,64,199,30000,42000,100,null,"CS2 3000-64"]
["Non Adjustable","CS2 3000",3000,65,0.2,50,25,150,65,65,200,30000,42000,100,null,"CS2 3000-65"]
["Non Adjustable","CS2 3000",3000,66,0.2,50,25,150,66,66,201,30000,42000,100,null,"CS2 3000-66"]
["Non Adjustable","CS2 3000",3000,67,0.2,50,25,150,67,67,202,30000,42000,100,null,"CS2 3000-67"]
["Non Adjustable","CS2 3000",3000,68,0.2,50,25,150,68,68,203,30000,42000,100,null,"CS2 3000-68"]
["Non Adjustable","CS2 3000",3000,69,0.2,50,25,150,69,69,204,30000,42000,100,null,"CS2 3000-69"]
["Non Adjustable","CS2 3000",3000,70,0.2,50,25,150,70,70,205,30000,42000,100,null,"CS2 3000-70"]
["Non Adjustable","CS2 3000",3000,71,0.2,50,25,150,71,71,206,30000,42000,100,null,"CS2 3000-71"]
["Non Adjustable","CS2 3000",3000,72,0.2,50,25,150,72,72,207,30000,42000,100,null,"CS2 3000-72"]
["Non Adjustable","CS2 3000",3000,73,0.2,50,25,150,73,73,208,30000,42000,100,null,"CS2 3000-73"]
["Non Adjustable","CS2 3000",3000,74,0.2,50,25,150,74,74,209,30000,42000,100,null,"CS2 3000-74"]
["Non Adjustable","CS2 3000",3000,75,0.2,50,25,150,75,75,{"$f":"135+D291","v":210},30000,42000,100,null,"CS2 3000-75"]
["Non Adjustable","CS2 3000",3000,76,0.2,50,25,150,76,76,211,30000,42000,100,null,"CS2 3000-76"]
["Non Adjustable","CS2 3000",3000,77,0.2,50,25,150,77,77,212,30000,42000,100,null,"CS2 3000-77"]
["Non Adjustable","CS2 3000",3000,78,0.2,50,25,150,78,78,213,30000,42000,100,null,"CS2 3000-78"]
["Non Adjustable","CS2 3000",3000,79,0.2,50,25,150,79,79,214,30000,42000,100,null,"CS2 3000-79"]
["Non Adjustable","CS2 3000",3000,80,0.2,50,25,150,80,80,215,30000,42000,100,null,"CS2 3000-80"]
["Non Adjustable","CS2 3000",3000,81,0.2,50,25,150,81,81,216,30000,42000,100,null,"CS2 3000-81"]
["Non Adjustable","CS2 3000",3000,82,0.2,50,25,150,82,82,217,30000,42000,100,null,"CS2 3000-82"]
["Non Adjustable","CS2 3000",3000,83,0.2,50,25,150,83,83,218,30000,42000,100,null,"CS2 3000-83"]
["Non Adjustable","CS2 3000",3000,84,0.2,50,25,150,84,84,219,30000,42000,100,null,"CS2 3000-84"]
["Non Adjustable","CS2 3000",3000,85,0.2,50,25,150,85,85,220,30000,42000,100,null,"CS2 3000-85"]
["Non Adjustable","CS2 3000",3000,86,0.2,50,25,150,86,86,221,30000,42000,100,null,"CS2 3000-86"]
["Non Adjustable","CS2 3000",3000,87,0.2,50,25,150,87,87,222,30000,42000,100,null,"CS2 3000-87"]
["Non Adjustable","CS2 3000",3000,88,0.2,50,25,150,88,88,223,30000,42000,100,null,"CS2 3000-88"]
["Non Adjustable","CS2 3000",3000,89,0.2,50,25,150,89,89,224,30000,42000,100,null,"CS2 3000-89"]
["Non Adjustable","CS2 3000",3000,90,0.2,50,25,150,90,90,225,30000,42000,100,null,"CS2 3000-90"]
["Non Adjustable","CS2 3000",3000,91,0.2,50,25,150,91,91,226,30000,42000,100,null,"CS2 3000-91"]
["Non Adjustable","CS2 3000",3000,92,0.2,50,25,150,92,92,227,30000,42000,100,null,"CS2 3000-92"]
["Non Adjustable","CS2 3000",3000,93,0.2,50,25,150,93,93,228,30000,42000,100,null,"CS2 3000-93"]
["Non Adjustable","CS2 3000",3000,94,0.2,50,25,150,94,94,229,30000,42000,100,null,"CS2 3000-94"]
["Non Adjustable","CS2 3000",3000,95,0.2,50,25,150,95,95,230,30000,42000,100,null,"CS2 3000-95"]
["Non Adjustable","CS2 3000",3000,96,0.2,50,25,150,96,96,231,30000,42000,100,null,"CS2 3000-96"]
["Non Adjustable","CS2 3000",3000,97,0.2,50,25,150,97,97,232,30000,42000,100,null,"CS2 3000-97"]
["Non Adjustable","CS2 3000",3000,98,0.2,50,25,150,98,98,233,30000,42000,100,null,"CS2 3000-98"]
["Non Adjustable","CS2 3000",3000,99,0.2,50,25,150,99,99,234,30000,42000,100,null,"CS2 3000-99"]
["Non Adjustable","CS2 3000",3000,100,0.2,50,25,150,100,100,235,30000,42000,100,null,"CS2 3000-100"]
["Non Adjustable","CS2 3000",3000,101,0.2,50,25,150,101,101,236,30000,42000,100,null,"CS2 3000-101"]
["Non Adjustable","CS2 3000",3000,102,0.2,50,25,150,102,102,237,30000,42000,100,null,"CS2 3000-102"]
["Non Adjustable","CS2 3000",3000,103,0.2,50,25,150,103,103,238,30000,42000,100,null,"CS2 3000-103"]
["Non Adjustable","CS2 3000",3000,104,0.2,50,25,150,104,104,239,30000,42000,100,null,"CS2 3000-104"]
["Non Adjustable","CS2 3000",3000,105,0.2,50,25,150,105,105,240,30000,42000,100,null,"CS2 3000-105"]
["Non Adjustable","CS2 3000",3000,106,0.2,50,25,150,106,106,241,30000,42000,100,null,"CS2 3000-106"]
["Non Adjustable","CS2 3000",3000,107,0.2,50,25,150,107,107,242,30000,42000,100,null,"CS2 3000-107"]
["Non Adjustable","CS2 3000",3000,108,0.2,50,25,150,108,108,243,30000,42000,100,null,"CS2 3000-108"]
["Non Adjustable","CS2 3000",3000,109,0.2,50,25,150,109,109,244,30000,42000,100,null,"CS2 3000-109"]
["Non Adjustable","CS2 3000",3000,110,0.2,50,25,150,110,110,245,30000,42000,100,null,"CS2 3000-110"]
["Non Adjustable","CS2 3000",3000,111,0.2,50,25,150,111,111,246,30000,42000,100,null,"CS2 3000-111"]
["Non Adjustable","CS2 3000",3000,112,0.2,50,25,150,112,112,247,30000,42000,100,null,"CS2 3000-112"]
["Non Adjustable","CS2 3000",3000,113,0.2,50,25,150,113,113,248,30000,42000,100,null,"CS2 3000-113"]
["Non Adjustable","CS2 3000",3000,114,0.2,50,25,150,114,114,249,30000,42000,100,null,"CS2 3000-114"]
["Non Adjustable","CS2 3000",3000,115,0.2,50,25,150,115,115,250,30000,42000,100,null,"CS2 3000-115"]
["Non Adjustable","CS2 3000",3000,116,0.2,50,25,150,{"$f":"D332","v":116},{"$f":"D332","v":116},251,30000,42000,100,null,"CS2 3000-116"]
["Non Adjustable","CS2 3000",3000,117,0.2,50,25,150,117,117,252,30000,42000,100,null,"CS2 3000-117"]
["Non Adjustable","CS2 3000",3000,118,0.2,50,25,150,118,118,253,30000,42000,100,null,"CS2 3000-118"]
["Non Adjustable","CS2 3000",3000,119,0.2,50,25,150,119,119,254,30000,42000,100,null,"CS2 3000-119"]
["Non Adjustable","CS2 3000",3000,120,0.2,50,25,150,120,120,255,30000,42000,100,null,"CS2 3000-120"]
["Non Adjustable","CS2 3000",3000,121,0.2,50,25,150,121,121,256,30000,42000,100,null,"CS2 3000-121"]
["Non Adjustable","CS2 3000",3000,122,0.2,50,25,150,122,122,257,30000,42000,100,null,"CS2 3000-122"]
["Non Adjustable","CS2 3000",3000,123,0.2,50,25,150,123,123,258,30000,42000,100,null,"CS2 3000-123"]
["Non Adjustable","CS2 3000",3000,124,0.2,50,25,150,124,124,259,30000,42000,100,null,"CS2 3000-124"]
["Non Adjustable","CS2 3000",3000,125,0.2,50,25,150,125,125,260,30000,42000,100,null,"CS2 3000-125"]
["Non Adjustable","CS2 3000",3000,126,0.2,50,25,150,126,126,261,30000,42000,100,null,"CS2 3000-126"]
["Non Adjustable","CS2 3000",3000,127,0.2,50,25,150,127,127,262,30000,42000,100,null,"CS2 3000-127"]
["Non Adjustable","CS2 3000",3000,128,0.2,50,25,150,128,128,263,30000,42000,100,null,"CS2 3000-128"]
["Non Adjustable","CS2 3000",3000,129,0.2,50,25,150,129,129,264,30000,42000,100,null,"CS2 3000-129"]
["Non Adjustable","CS2 3000",3000,130,0.2,50,25,150,130,130,265,30000,42000,100,null,"CS2 3000-130"]
["Non Adjustable","CS2 3000",3000,131,0.2,50,25,150,131,131,266,30000,42000,100,null,"CS2 3000-131"]
["Non Adjustable","CS2 3000",3000,132,0.2,50,25,150,132,132,267,30000,42000,100,null,"CS2 3000-132"]
["Non Adjustable","CS2 3000",3000,133,0.2,50,25,150,133,133,268,30000,42000,100,null,"CS2 3000-133"]
["Non Adjustable","CS2 3000",3000,134,0.2,50,25,150,134,134,269,30000,42000,100,null,"CS2 3000-134"]
["Non Adjustable","CS2 3000",3000,135,0.2,50,25,150,135,135,270,30000,42000,100,null,"CS2 3000-135"]
["Non Adjustable","CS2 3000",3000,136,0.2,50,25,150,136,136,271,30000,42000,100,null,"CS2 3000-136"]
["Non Adjustable","CS2 3000",3000,137,0.2,50,25,150,137,137,272,30000,42000,100,null,"CS2 3000-137"]
["Non Adjustable","CS2 3000",3000,138,0.2,50,25,150,138,138,273,30000,42000,100,null,"CS2 3000-138"]
["Non Adjustable","CS2 3000",3000,139,0.2,50,25,150,139,139,{"$f":"135+D355","v":274},30000,42000,100,null,"CS2 3000-139"]
["Non Adjustable","CS2 3000",3000,140,0.2,50,25,150,140,140,275,30000,42000,100,null,"CS2 3000-140"]
["Non Adjustable","CS2 3000",3000,141,0.2,50,25,150,141,141,276,30000,42000,100,null,"CS2 3000-141"]
["Non Adjustable","CS2 3000",3000,142,0.2,50,25,150,142,142,277,30000,42000,100,null,"CS2 3000-142"]
["Non Adjustable","CS2 3000",3000,143,0.2,50,25,150,143,143,278,30000,42000,100,null,"CS2 3000-143"]
["Non Adjustable","CS2 3000",3000,144,0.2,50,25,150,144,144,279,30000,42000,100,null,"CS2 3000-144"]
["Non Adjustable","CS2 3000",3000,145,0.2,50,25,150,145,145,280,30000,42000,100,null,"CS2 3000-145"]
["Non Adjustable","CS2 3000",3000,146,0.2,50,25,150,146,146,281,30000,42000,100,null,"CS2 3000-146"]
["Non Adjustable","CS2 3000",3000,147,0.2,50,25,150,147,147,282,30000,42000,100,null,"CS2 3000-147"]
["Non Adjustable","CS2 3000",3000,148,0.2,50,25,150,148,148,283,30000,42000,100,null,"CS2 3000-148"]
["Non Adjustable","CS2 3000",3000,149,0.2,50,25,150,149,149,284,30000,42000,100,null,"CS2 3000-149"]
["Non Adjustable","CS2 3000",3000,150,0.2,50,25,150,150,150,285,30000,42000,100,null,"CS2 3000-150"]
["Non Adjustable","CS2 3000",3000,151,0.2,50,25,150,151,151,286,30000,42000,100,null,"CS2 3000-151"]
["Non Adjustable","CS2 3000",3000,152,0.2,50,25,150,152,152,287,30000,42000,100,null,"CS2 3000-152"]
["Non Adjustable","CS2 3000",3000,153,0.2,50,25,150,153,153,288,30000,42000,100,null,"CS2 3000-153"]
["Non Adjustable","CS2 3000",3000,154,0.2,50,25,150,154,154,289,30000,42000,100,null,"CS2 3000-154"]
["Non Adjustable","CS2 3000",3000,155,0.2,50,25,150,155,155,290,30000,42000,100,null,"CS2 3000-155"]
["Non Adjustable","CS2 3000",3000,156,0.2,50,25,150,156,156,291,30000,42000,100,null,"CS2 3000-156"]
["Non Adjustable","CS2 3000",3000,157,0.2,50,25,150,157,157,292,30000,42000,100,null,"CS2 3000-157"]
["Non Adjustable","CS2 3000",3000,158,0.2,50,25,150,158,158,293,30000,42000,100,null,"CS2 3000-158"]
["Non Adjustable","CS2 3000",3000,159,0.2,50,25,150,159,159,294,30000,42000,100,null,"CS2 3000-159"]
["Non Adjustable","CS2 3000",3000,160,0.2,50,25,150,160,160,295,30000,42000,100,null,"CS2 3000-160"]
["Non Adjustable","CS2 5000",5000,6,{"$f":"AVERAGE(0.15,0.12)","v":0.13500000000000001},65,25,150,6,6,{"$f":"160+D377","v":166},50000,74000,125,null,"CS2 5000-06"]
["Non Adjustable","CS2 5000",5000,7,{"$f":"AVERAGE(0.15,0.12)","v":0.13500000000000001},65,25,150,7,7,167,50000,74000,125,null,"CS2 5000-07"]
["Non Adjustable","CS2 5000",5000,8,0.13500000000000001,65,25,150,8,8,168,50000,74000,125,null,"CS2 5000-08"]
["Non Adjustable","CS2 5000",5000,9,0.13500000000000001,65,25,150,9,9,169,50000,74000,125,null,"CS2 5000-09"]
["Non Adjustable","CS2 5000",5000,10,{"$f":"AVERAGE(0.15,0.12)","v":0.13500000000000001},65,25,150,10,10,{"$f":"160+D381","v":170},50000,74000,125,null,"CS2 5000-10"]
["Non Adjustable","CS2 5000",5000,11,{"$f":"AVERAGE(0.15,0.12)","v":0.13500000000000001},65,25,150,11,11,{"$f":"160+D382","v":171},50000,74000,125,null,"CS2 5000-11"]
["Non Adjustable","CS2 5000",5000,12,0.13500000000000001,65,25,150,12,12,172,50000,74000,125,null,"CS2 5000-12"]
["Non Adjustable","CS2 5000",5000,13,0.13500000000000001,65,25,150,13,13,173,50000,74000,125,null,"CS2 5000-13"]
["Non Adjustable","CS2 5000",5000,14,0.13500000000000001,65,25,150,14,14,174,50000,74000,125,null,"CS2 5000-14"]
["Non Adjustable","CS2 5000",5000,15,0.13500000000000001,65,25,150,15,15,175,50000,74000,125,null,"CS2 5000-15"]
["Non Adjustable","CS2 5000",5000,16,0.13500000000000001,65,25,150,16,16,176,50000,74000,125,null,"CS2 5000-16"]
["Non Adjustable","CS2 5000",5000,17,0.13500000000000001,65,25,150,17,17,177,50000,74000,125,null,"CS2 5000-17"]
["Non Adjustable","CS2 5000",5000,18,0.13500000000000001,65,25,150,18,18,178,50000,74000,125,null,"CS2 5000-18"]
["Non Adjustable","CS2 5000",5000,19,0.13500000000000001,65,25,150,19,19,179,50000,74000,125,null,"CS2 5000-19"]
["Non Adjustable","CS2 5000",5000,20,0.13500000000000001,65,25,150,20,20,180,50000,74000,125,null,"CS2 5000-20"]
["Non Adjustable","CS2 5000",5000,21,0.13500000000000001,65,25,150,21,21,181,50000,74000,125,null,"CS2 5000-21"]
["Non Adjustable","CS2 5000",5000,22,0.13500000000000001,65,25,150,22,22,182,50000,74000,125,null,"CS2 5000-22"]
["Non Adjustable","CS2 5000",5000,23,0.13500000000000001,65,25,150,23,23,183,50000,74000,125,null,"CS2 5000-23"]
["Non Adjustable","CS2 5000",5000,24,0.13500000000000001,65,25,150,24,24,184,50000,74000,125,null,"CS2 5000-24"]
["Non Adjustable","CS2 5000",5000,25,0.13500000000000001,65,25,150,25,25,185,50000,74000,125,null,"CS2 5000-25"]
["Non Adjustable","CS2 5000",5000,26,0.13500000000000001,65,25,150,26,26,186,50000,74000,125,null,"CS2 5000-26"]
["Non Adjustable","CS2 5000",5000,27,0.13500000000000001,65,25,150,27,27,187,50000,74000,125,null,"CS2 5000-27"]
["Non Adjustable","CS2 5000",5000,28,0.13500000000000001,65,25,150,28,28,188,50000,74000,125,null,"CS2 5000-28"]
["Non Adjustable","CS2 5000",5000,29,0.13500000000000001,65,25,150,{"$f":"D400","v":29},{"$f":"D400","v":29},189,50000,74000,125,null,"CS2 5000-29"]
["Non Adjustable","CS2 5000",5000,30,0.13500000000000001,65,25,150,30,30,190,50000,74000,125,null,"CS2 5000-30"]
["Non Adjustable","CS2 5000",5000,31,0.13500000000000001,65,25,150,31,31,191,50000,74000,125,null,"CS2 5000-31"]
["Non Adjustable","CS2 5000",5000,32,0.13500000000000001,65,25,150,32,32,192,50000,74000,125,null,"CS2 5000-32"]
["Non Adjustable","CS2 5000",5000,33,0.13500000000000001,65,25,150,33,33,193,50000,74000,125,null,"CS2 5000-33"]
["Non Adjustable","CS2 5000",5000,34,0.13500000000000001,65,25,150,34,34,194,50000,74000,125,null,"CS2 5000-34"]
["Non Adjustable","CS2 5000",5000,35,0.13500000000000001,65,25,150,35,35,195,50000,74000,125,null,"CS2 5000-35"]
["Non Adjustable","CS2 5000",5000,36,0.13500000000000001,65,25,150,36,36,196,50000,74000,125,null,"CS2 5000-36"]
["Non Adjustable","CS2 5000",5000,37,0.13500000000000001,65,25,150,37,37,197,50000,74000,125,null,"CS2 5000-37"]
["Non Adjustable","CS2 5000",5000,38,0.13500000000000001,65,25,150,38,38,198,50000,74000,125,null,"CS2 5000-38"]
["Non Adjustable","CS2 5000",5000,39,0.13500000000000001,65,25,150,39,39,199,50000,74000,125,null,"CS2 5000-39"]
["Non Adjustable","CS2 5000",5000,40,0.13500000000000001,65,25,150,40,40,200,50000,74000,125,null,"CS2 5000-40"]
["Non Adjustable","CS2 5000",5000,41,0.13500000000000001,65,25,150,41,41,201,50000,74000,125,null,"CS2 5000-41"]
["Non Adjustable","CS2 5000",5000,42,0.13500000000000001,65,25,150,42,42,202,50000,74000,125,null,"CS2 5000-42"]
["Non Adjustable","CS2 5000",5000,43,0.13500000000000001,65,25,150,43,43,203,50000,74000,125,null,"CS2 5000-43"]
["Non Adjustable","CS2 5000",5000,44,0.13500000000000001,65,25,150,44,44,204,50000,74000,125,null,"CS2 5000-44"]
["Non Adjustable","CS2 5000",5000,45,0.13500000000000001,65,25,150,45,45,205,50000,74000,125,null,"CS2 5000-45"]
["Non Adjustable","CS2 5000",5000,46,0.13500000000000001,65,25,150,46,46,206,50000,74000,125,null,"CS2 5000-46"]
["Non Adjustable","CS2 5000",5000,47,0.13500000000000001,65,25,150,47,47,207,50000,74000,125,null,"CS2 5000-47"]
["Non Adjustable","CS2 5000",5000,48,0.13500000000000001,65,25,150,48,48,208,50000,74000,125,null,"CS2 5000-48"]
["Non Adjustable","CS2 5000",5000,49,0.13500000000000001,65,25,150,49,49,209,50000,74000,125,null,"CS2 5000-49"]
["Non Adjustable","CS2 5000",5000,50,0.13500000000000001,65,25,150,50,50,210,50000,74000,125,null,"CS2 5000-50"]
["Non Adjustable","CS2 5000",5000,51,0.13500000000000001,65,25,150,51,51,211,50000,74000,125,null,"CS2 5000-51"]
["Non Adjustable","CS2 5000",5000,52,0.13500000000000001,65,25,150,52,52,212,50000,74000,125,null,"CS2 5000-52"]
["Non Adjustable","CS2 5000",5000,53,0.13500000000000001,65,25,150,53,53,213,50000,74000,125,null,"CS2 5000-53"]
["Non Adjustable","CS2 5000",5000,54,0.13500000000000001,65,25,150,54,54,214,50000,74000,125,null,"CS2 5000-54"]
["Non Adjustable","CS2 5000",5000,55,0.13500000000000001,65,25,150,55,55,215,50000,74000,125,null,"CS2 5000-55"]
["Non Adjustable","CS2 5000",5000,56,0.13500000000000001,65,25,150,56,56,216,50000,74000,125,null,"CS2 5000-56"]
["Non Adjustable","CS2 5000",5000,57,0.13500000000000001,65,25,150,57,57,217,50000,74000,125,null,"CS2 5000-57"]
["Non Adjustable","CS2 5000",5000,58,0.13500000000000001,65,25,150,58,58,218,50000,74000,125,null,"CS2 5000-58"]
["Non Adjustable","CS2 5000",5000,59,0.13500000000000001,65,25,150,59,59,219,50000,74000,125,null,"CS2 5000-59"]
["Non Adjustable","CS2 5000",5000,60,0.13500000000000001,65,25,150,60,60,220,50000,74000,125,null,"CS2 5000-60"]
["Non Adjustable","CS2 5000",5000,61,0.13500000000000001,65,25,150,61,61,221,50000,74000,125,null,"CS2 5000-61"]
["Non Adjustable","CS2 5000",5000,62,0.13500000000000001,65,25,150,62,62,222,50000,74000,125,null,"CS2 5000-62"]
["Non Adjustable","CS2 5000",5000,63,0.13500000000000001,65,25,150,63,63,223,50000,74000,125,null,"CS2 5000-63"]
["Non Adjustable","CS2 5000",5000,64,0.13500000000000001,65,25,150,64,64,224,50000,74000,125,null,"CS2 5000-64"]
["Non Adjustable","CS2 5000",5000,65,0.13500000000000001,65,25,150,65,65,225,50000,74000,125,null,"CS2 5000-65"]
["Non Adjustable","CS2 5000",5000,66,0.13500000000000001,65,25,150,66,66,226,50000,74000,125,null,"CS2 5000-66"]
["Non Adjustable","CS2 5000",5000,67,0.13500000000000001,65,25,150,67,67,227,50000,74000,125,null,"CS2 5000-67"]
["Non Adjustable","CS2 5000",5000,68,0.13500000000000001,65,25,150,68,68,228,50000,74000,125,null,"CS2 5000-68"]
["Non Adjustable","CS2 5000",5000,69,0.13500000000000001,65,25,150,69,69,229,50000,74000,125,null,"CS2 5000-69"]
["Non Adjustable","CS2 5000",5000,70,0.13500000000000001,65,25,150,70,70,230,50000,74000,125,null,"CS2 5000-70"]
["Non Adjustable","CS2 5000",5000,71,0.13500000000000001,65,25,150,71,71,231,50000,74000,125,null,"CS2 5000-71"]
["Non Adjustable","CS2 5000",5000,72,0.13500000000000001,65,25,150,72,72,232,50000,74000,125,null,"CS2 5000-72"]
["Non Adjustable","CS2 5000",5000,73,0.13500000000000001,65,25,150,73,73,233,50000,74000,125,null,"CS2 5000-73"]
["Non Adjustable","CS2 5000",5000,74,0.13500000000000001,65,25,150,74,74,234,50000,74000,125,null,"CS2 5000-74"]
["Non Adjustable","CS2 5000",5000,75,{"$f":"AVERAGE(0.15,0.12)","v":0.13500000000000001},65,25,150,75,75,{"$f":"160+D446","v":235},50000,74000,125,null,"CS2 5000-75"]
["Non Adjustable","CS2 5000",5000,76,0.13500000000000001,65,25,150,76,76,236,50000,74000,125,null,"CS2 5000-76"]
["Non Adjustable","CS2 5000",5000,77,0.13500000000000001,65,25,150,77,77,237,50000,74000,125,null,"CS2 5000-77"]
["Non Adjustable","CS2 5000",5000,78,0.13500000000000001,65,25,150,78,78,238,50000,74000,125,null,"CS2 5000-78"]
["Non Adjustable","CS2 5000",5000,79,0.13500000000000001,65,25,150,79,79,239,50000,74000,125,null,"CS2 5000-79"]
["Non Adjustable","CS2 5000",5000,80,0.13500000000000001,65,25,150,80,80,240,50000,74000,125,null,"CS2 5000-80"]
["Non Adjustable","CS2 5000",5000,81,0.13500000000000001,65,25,150,81,81,241,50000,74000,125,null,"CS2 5000-81"]
["Non Adjustable","CS2 5000",5000,82,0.13500000000000001,65,25,150,82,82,242,50000,74000,125,null,"CS2 5000-82"]
["Non Adjustable","CS2 5000",5000,83,0.13500000000000001,65,25,150,83,83,243,50000,74000,125,null,"CS2 5000-83"]
["Non Adjustable","CS2 5000",5000,84,0.13500000000000001,65,25,150,84,84,244,50000,74000,125,null,"CS2 5000-84"]
["Non Adjustable","CS2 5000",5000,85,0.13500000000000001,65,25,150,85,85,245,50000,74000,125,null,"CS2 5000-85"]
["Non Adjustable","CS2 5000",5000,86,0.13500000000000001,65,25,150,86,86,246,50000,74000,125,null,"CS2 5000-86"]
["Non Adjustable","CS2 5000",5000,87,0.13500000000000001,65,25,150,87,87,247,50000,74000,125,null,"CS2 5000-87"]
["Non Adjustable","CS2 5000",5000,88,0.13500000000000001,65,25,150,88,88,248,50000,74000,125,null,"CS2 5000-88"]
["Non Adjustable","CS2 5000",5000,89,0.13500000000000001,65,25,150,89,89,249,50000,74000,125,null,"CS2 5000-89"]
["Non Adjustable","CS2 5000",5000,90,0.13500000000000001,65,25,150,90,90,250,50000,74000,125,null,"CS2 5000-90"]
["Non Adjustable","CS2 5000",5000,91,0.13500000000000001,65,25,150,91,91,251,50000,74000,125,null,"CS2 5000-91"]
["Non Adjustable","CS2 5000",5000,92,0.13500000000000001,65,25,150,92,92,252,50000,74000,125,null,"CS2 5000-92"]
["Non Adjustable","CS2 5000",5000,93,0.13500000000000001,65,25,150,{"$f":"D464","v":93},{"$f":"D464","v":93},253,50000,74000,125,null,"CS2 5000-93"]
["Non Adjustable","CS2 5000",5000,94,0.13500000000000001,65,25,150,94,94,254,50000,74000,125,null,"CS2 5000-94"]
["Non Adjustable","CS2 5000",5000,95,0.13500000000000001,65,25,150,95,95,255,50000,74000,125,null,"CS2 5000-95"]
["Non Adjustable","CS2 5000",5000,96,0.13500000000000001,65,25,150,96,96,256,50000,74000,125,null,"CS2 5000-96"]
["Non Adjustable","CS2 5000",5000,97,0.13500000000000001,65,25,150,97,97,257,50000,74000,125,null,"CS2 5000-97"]
["Non Adjustable","CS2 5000",5000,98,0.13500000000000001,65,25,150,98,98,258,50000,74000,125,null,"CS2 5000-98"]
["Non Adjustable","CS2 5000",5000,99,0.13500000000000001,65,25,150,99,99,259,50000,74000,125,null,"CS2 5000-99"]
["Non Adjustable","CS2 5000",5000,100,0.13500000000000001,65,25,150,100,100,260,50000,74000,125,null,"CS2 5000-100"]
["Non Adjustable","CS2 5000",5000,101,0.13500000000000001,65,25,150,101,101,261,50000,74000,125,null,"CS2 5000-101"]
["Non Adjustable","CS2 5000",5000,102,0.13500000000000001,65,25,150,102,102,262,50000,74000,125,null,"CS2 5000-102"]
["Non Adjustable","CS2 5000",5000,103,0.13500000000000001,65,25,150,103,103,263,50000,74000,125,null,"CS2 5000-103"]
["Non Adjustable","CS2 5000",5000,104,0.13500000000000001,65,25,150,104,104,264,50000,74000,125,null,"CS2 5000-104"]
["Non Adjustable","CS2 5000",5000,105,0.13500000000000001,65,25,150,105,105,265,50000,74000,125,null,"CS2 5000-105"]
["Non Adjustable","CS2 5000",5000,106,0.13500000000000001,65,25,150,106,106,266,50000,74000,125,null,"CS2 5000-106"]
["Non Adjustable","CS2 5000",5000,107,0.13500000000000001,65,25,150,107,107,267,50000,74000,125,null,"CS2 5000-107"]
["Non Adjustable","CS2 5000",5000,108,0.13500000000000001,65,25,150,108,108,268,50000,74000,125,null,"CS2 5000-108"]
["Non Adjustable","CS2 5000",5000,109,0.13500000000000001,65,25,150,109,109,269,50000,74000,125,null,"CS2 5000-109"]
["Non Adjustable","CS2 5000",5000,110,0.13500000000000001,65,25,150,110,110,270,50000,74000,125,null,"CS2 5000-110"]
["Non Adjustable","CS2 5000",5000,111,0.13500000000000001,65,25,150,111,111,271,50000,74000,125,null,"CS2 5000-111"]
["Non Adjustable","CS2 5000",5000,112,0.13500000000000001,65,25,150,112,112,272,50000,74000,125,null,"CS2 5000-112"]
["Non Adjustable","CS2 5000",5000,113,0.13500000000000001,65,25,150,113,113,273,50000,74000,125,null,"CS2 5000-113"]
["Non Adjustable","CS2 5000",5000,114,0.13500000000000001,65,25,150,114,114,274,50000,74000,125,null,"CS2 5000-114"]
["Non Adjustable","CS2 5000",5000,115,0.13500000000000001,65,25,150,115,115,275,50000,74000,125,null,"CS2 5000-115"]
["Non Adjustable","CS2 5000",5000,116,0.13500000000000001,65,25,150,116,116,276,50000,74000,125,null,"CS2 5000-116"]
["Non Adjustable","CS2 5000",5000,117,0.13500000000000001,65,25,150,117,117,277,50000,74000,125,null,"CS2 5000-117"]
["Non Adjustable","CS2 5000",5000,118,0.13500000000000001,65,25,150,118,118,278,50000,74000,125,null,"CS2 5000-118"]
["Non Adjustable","CS2 5000",5000,119,0.13500000000000001,65,25,150,119,119,279,50000,74000,125,null,"CS2 5000-119"]
["Non Adjustable","CS2 5000",5000,120,0.13500000000000001,65,25,150,120,120,280,50000,74000,125,null,"CS2 5000-120"]
["Non Adjustable","CS2 5000",5000,121,0.13500000000000001,65,25,150,121,121,281,50000,74000,125,null,"CS2 5000-121"]
["Non Adjustable","CS2 5000",5000,122,0.13500000000000001,65,25,150,122,122,282,50000,74000,125,null,"CS2 5000-122"]
["Non Adjustable","CS2 5000",5000,123,0.13500000000000001,65,25,150,123,123,283,50000,74000,125,null,"CS2 5000-123"]
["Non Adjustable","CS2 5000",5000,124,0.13500000000000001,65,25,150,124,124,284,50000,74000,125,null,"CS2 5000-124"]
["Non Adjustable","CS2 5000",5000,125,0.13500000000000001,65,25,150,125,125,285,50000,74000,125,null,"CS2 5000-125"]
["Non Adjustable","CS2 5000",5000,126,0.13500000000000001,65,25,150,126,126,286,50000,74000,125,null,"CS2 5000-126"]
["Non Adjustable","CS2 5000",5000,127,0.13500000000000001,65,25,150,127,127,287,50000,74000,125,null,"CS2 5000-127"]
["Non Adjustable","CS2 5000",5000,128,0.13500000000000001,65,25,150,128,128,288,50000,74000,125,null,"CS2 5000-128"]
["Non Adjustable","CS2 5000",5000,129,0.13500000000000001,65,25,150,129,129,289,50000,74000,125,null,"CS2 5000-129"]
["Non Adjustable","CS2 5000",5000,130,0.13500000000000001,65,25,150,130,130,290,50000,74000,125,null,"CS2 5000-130"]
["Non Adjustable","CS2 5000",5000,131,0.13500000000000001,65,25,150,131,131,291,50000,74000,125,null,"CS2 5000-131"]
["Non Adjustable","CS2 5000",5000,132,0.13500000000000001,65,25,150,132,132,292,50000,74000,125,null,"CS2 5000-132"]
["Non Adjustable","CS2 5000",5000,133,0.13500000000000001,65,25,150,133,133,293,50000,74000,125,null,"CS2 5000-133"]
["Non Adjustable","CS2 5000",5000,134,0.13500000000000001,65,25,150,134,134,294,50000,74000,125,null,"CS2 5000-134"]
["Non Adjustable","CS2 5000",5000,135,0.13500000000000001,65,25,150,135,135,295,50000,74000,125,null,"CS2 5000-135"]
["Non Adjustable","CS2 5000",5000,136,0.13500000000000001,65,25,150,136,136,296,50000,74000,125,null,"CS2 5000-136"]
["Non Adjustable","CS2 5000",5000,137,0.13500000000000001,65,25,150,137,137,297,50000,74000,125,null,"CS2 5000-137"]
["Non Adjustable","CS2 5000",5000,138,0.13500000000000001,65,25,150,138,138,298,50000,74000,125,null,"CS2 5000-138"]
["Non Adjustable","CS2 5000",5000,139,{"$f":"AVERAGE(0.15,0.12)","v":0.13500000000000001},65,25,150,139,139,{"$f":"160+D510","v":299},50000,74000,125,null,"CS2 5000-139"]
["Non Adjustable","CS2 5000",5000,140,0.13500000000000001,65,25,150,140,140,300,50000,74000,125,null,"CS2 5000-140"]
["Non Adjustable","CS2 5000",5000,141,0.13500000000000001,65,25,150,141,141,301,50000,74000,125,null,"CS2 5000-141"]
["Non Adjustable","CS2 5000",5000,142,0.13500000000000001,65,25,150,142,142,302,50000,74000,125,null,"CS2 5000-142"]
["Non Adjustable","CS2 5000",5000,143,0.13500000000000001,65,25,150,143,143,303,50000,74000,125,null,"CS2 5000-143"]
["Non Adjustable","CS2 5000",5000,144,0.13500000000000001,65,25,150,144,144,304,50000,74000,125,null,"CS2 5000-144"]
["Non Adjustable","CS2 5000",5000,145,0.13500000000000001,65,25,150,145,145,305,50000,74000,125,null,"CS2 5000-145"]
["Non Adjustable","CS2 5000",5000,146,0.13500000000000001,65,25,150,146,146,306,50000,74000,125,null,"CS2 5000-146"]
["Non Adjustable","CS2 5000",5000,147,0.13500000000000001,65,25,150,147,147,307,50000,74000,125,null,"CS2 5000-147"]
["Non Adjustable","CS2 5000",5000,148,0.13500000000000001,65,25,150,148,148,308,50000,74000,125,null,"CS2 5000-148"]
["Non Adjustable","CS2 5000",5000,149,0.13500000000000001,65,25,150,149,149,309,50000,74000,125,null,"CS2 5000-149"]
["Non Adjustable","CS2 5000",5000,150,0.13500000000000001,65,25,150,150,150,310,50000,74000,125,null,"CS2 5000-150"]
["Non Adjustable","CS2 5000",5000,151,0.13500000000000001,65,25,150,151,151,311,50000,74000,125,null,"CS2 5000-151"]
["Non Adjustable","CS2 5000",5000,152,0.13500000000000001,65,25,150,152,152,312,50000,74000,125,null,"CS2 5000-152"]
["Non Adjustable","CS2 5000",5000,153,0.13500000000000001,65,25,150,153,153,313,50000,74000,125,null,"CS2 5000-153"]
["Non Adjustable","CS2 5000",5000,154,0.13500000000000001,65,25,150,154,154,314,50000,74000,125,null,"CS2 5000-154"]
["Non Adjustable","CS2 5000",5000,155,0.13500000000000001,65,25,150,155,155,315,50000,74000,125,null,"CS2 5000-155"]
["Non Adjustable","CS2 5000",5000,156,0.13500000000000001,65,25,150,156,156,316,50000,74000,125,null,"CS2 5000-156"]
["Non Adjustable","CS2 5000",5000,157,0.13500000000000001,65,25,150,{"$f":"D528","v":157},{"$f":"D528","v":157},317,50000,74000,125,null,"CS2 5000-157"]
["Non Adjustable","CS2 5000",5000,158,0.13500000000000001,65,25,150,158,158,318,50000,74000,125,null,"CS2 5000-158"]
["Non Adjustable","CS2 5000",5000,159,0.13500000000000001,65,25,150,159,159,319,50000,74000,125,null,"CS2 5000-159"]
["Non Adjustable","CS2 5000",5000,160,0.13500000000000001,65,25,150,160,160,320,50000,74000,125,null,"CS2 5000-160"]
["Non Adjustable","CS2 7500",7500,8,{"$f":"AVERAGE(0.13,0.08)","v":0.10500000000000001},80,25,150,8,8,{"$f":"180+D532","v":188},75000,98000,160,null,"CS2 7500-08"]
["Non Adjustable","CS2 7500",7500,9,0.10500000000000001,80,25,150,9,9,{"$f":"180+D533","v":189},75000,98000,160,null,"CS2 7500-09"]
["Non Adjustable","CS2 7500",7500,10,0.10500000000000001,80,25,150,10,10,{"$f":"180+D534","v":190},75000,98000,160,null,"CS2 7500-10"]
["Non Adjustable","CS2 7500",7500,11,0.10500000000000001,80,25,150,11,11,{"$f":"180+D535","v":191},75000,98000,160,null,"CS2 7500-11"]
["Non Adjustable","CS2 7500",7500,12,0.10500000000000001,80,25,150,12,12,192,75000,98000,160,null,"CS2 7500-12"]
["Non Adjustable","CS2 7500",7500,13,0.10500000000000001,80,25,150,13,13,193,75000,98000,160,null,"CS2 7500-13"]
["Non Adjustable","CS2 7500",7500,14,0.10500000000000001,80,25,150,14,14,194,75000,98000,160,null,"CS2 7500-14"]
["Non Adjustable","CS2 7500",7500,15,0.10500000000000001,80,25,150,15,15,195,75000,98000,160,null,"CS2 7500-15"]
["Non Adjustable","CS2 7500",7500,16,0.10500000000000001,80,25,150,16,16,196,75000,98000,160,null,"CS2 7500-16"]
["Non Adjustable","CS2 7500",7500,17,0.10500000000000001,80,25,150,17,17,197,75000,98000,160,null,"CS2 7500-17"]
["Non Adjustable","CS2 7500",7500,18,0.10500000000000001,80,25,150,18,18,198,75000,98000,160,null,"CS2 7500-18"]
["Non Adjustable","CS2 7500",7500,19,0.10500000000000001,80,25,150,19,19,199,75000,98000,160,null,"CS2 7500-19"]
["Non Adjustable","CS2 7500",7500,20,0.10500000000000001,80,25,150,20,20,200,75000,98000,160,null,"CS2 7500-20"]
["Non Adjustable","CS2 7500",7500,21,0.10500000000000001,80,25,150,21,21,201,75000,98000,160,null,"CS2 7500-21"]
["Non Adjustable","CS2 7500",7500,22,0.10500000000000001,80,25,150,22,22,202,75000,98000,160,null,"CS2 7500-22"]
["Non Adjustable","CS2 7500",7500,23,0.10500000000000001,80,25,150,23,23,203,75000,98000,160,null,"CS2 7500-23"]
["Non Adjustable","CS2 7500",7500,24,0.10500000000000001,80,25,150,24,24,204,75000,98000,160,null,"CS2 7500-24"]
["Non Adjustable","CS2 7500",7500,25,0.10500000000000001,80,25,150,25,25,205,75000,98000,160,null,"CS2 7500-25"]
["Non Adjustable","CS2 7500",7500,26,0.10500000000000001,80,25,150,26,26,206,75000,98000,160,null,"CS2 7500-26"]
["Non Adjustable","CS2 7500",7500,27,0.10500000000000001,80,25,150,27,27,207,75000,98000,160,null,"CS2 7500-27"]
["Non Adjustable","CS2 7500",7500,28,0.10500000000000001,80,25,150,28,28,208,75000,98000,160,null,"CS2 7500-28"]
["Non Adjustable","CS2 7500",7500,29,0.10500000000000001,80,25,150,29,29,209,75000,98000,160,null,"CS2 7500-29"]
["Non Adjustable","CS2 7500",7500,30,0.10500000000000001,80,25,150,30,30,210,75000,98000,160,null,"CS2 7500-30"]
["Non Adjustable","CS2 7500",7500,31,0.10500000000000001,80,25,150,31,31,211,75000,98000,160,null,"CS2 7500-31"]
["Non Adjustable","CS2 7500",7500,32,0.10500000000000001,80,25,150,32,32,212,75000,98000,160,null,"CS2 7500-32"]
["Non Adjustable","CS2 7500",7500,33,0.10500000000000001,80,25,150,33,33,213,75000,98000,160,null,"CS2 7500-33"]
["Non Adjustable","CS2 7500",7500,34,0.10500000000000001,80,25,150,34,34,214,75000,98000,160,null,"CS2 7500-34"]
["Non Adjustable","CS2 7500",7500,35,0.10500000000000001,80,25,150,35,35,215,75000,98000,160,null,"CS2 7500-35"]
["Non Adjustable","CS2 7500",7500,36,0.10500000000000001,80,25,150,36,36,216,75000,98000,160,null,"CS2 7500-36"]
["Non Adjustable","CS2 7500",7500,37,0.10500000000000001,80,25,150,37,37,217,75000,98000,160,null,"CS2 7500-37"]
["Non Adjustable","CS2 7500",7500,38,0.10500000000000001,80,25,150,38,38,218,75000,98000,160,null,"CS2 7500-38"]
["Non Adjustable","CS2 7500",7500,39,0.10500000000000001,80,25,150,39,39,219,75000,98000,160,null,"CS2 7500-39"]
["Non Adjustable","CS2 7500",7500,40,0.10500000000000001,80,25,150,40,40,220,75000,98000,160,null,"CS2 7500-40"]
["Non Adjustable","CS2 7500",7500,41,0.10500000000000001,80,25,150,41,41,221,75000,98000,160,null,"CS2 7500-41"]
["Non Adjustable","CS2 7500",7500,42,0.10500000000000001,80,25,150,42,42,222,75000,98000,160,null,"CS2 7500-42"]
["Non Adjustable","CS2 7500",7500,43,0.10500000000000001,80,25,150,43,43,223,75000,98000,160,null,"CS2 7500-43"]
["Non Adjustable","CS2 7500",7500,44,0.10500000000000001,80,25,150,44,44,224,75000,98000,160,null,"CS2 7500-44"]
["Non Adjustable","CS2 7500",7500,45,0.10500000000000001,80,25,150,45,45,225,75000,98000,160,null,"CS2 7500-45"]
["Non Adjustable","CS2 7500",7500,46,0.10500000000000001,80,25,150,46,46,226,75000,98000,160,null,"CS2 7500-46"]
["Non Adjustable","CS2 7500",7500,47,0.10500000000000001,80,25,150,47,47,227,75000,98000,160,null,"CS2 7500-47"]
["Non Adjustable","CS2 7500",7500,48,0.10500000000000001,80,25,150,48,48,228,75000,98000,160,null,"CS2 7500-48"]
["Non Adjustable","CS2 7500",7500,49,0.10500000000000001,80,25,150,49,49,229,75000,98000,160,null,"CS2 7500-49"]
["Non Adjustable","CS2 7500",7500,50,0.10500000000000001,80,25,150,50,50,230,75000,98000,160,null,"CS2 7500-50"]
["Non Adjustable","CS2 7500",7500,51,0.10500000000000001,80,25,150,51,51,231,75000,98000,160,null,"CS2 7500-51"]
["Non Adjustable","CS2 7500",7500,52,0.10500000000000001,80,25,150,52,52,232,75000,98000,160,null,"CS2 7500-52"]
["Non Adjustable","CS2 7500",7500,53,0.10500000000000001,80,25,150,53,53,233,75000,98000,160,null,"CS2 7500-53"]
["Non Adjustable","CS2 7500",7500,54,0.10500000000000001,80,25,150,54,54,234,75000,98000,160,null,"CS2 7500-54"]
["Non Adjustable","CS2 7500",7500,55,0.10500000000000001,80,25,150,55,55,235,75000,98000,160,null,"CS2 7500-55"]
["Non Adjustable","CS2 7500",7500,56,0.10500000000000001,80,25,150,56,56,236,75000,98000,160,null,"CS2 7500-56"]
["Non Adjustable","CS2 7500",7500,57,0.10500000000000001,80,25,150,57,57,237,75000,98000,160,null,"CS2 7500-57"]
["Non Adjustable","CS2 7500",7500,58,0.10500000000000001,80,25,150,58,58,238,75000,98000,160,null,"CS2 7500-58"]
["Non Adjustable","CS2 7500",7500,59,0.10500000000000001,80,25,150,59,59,239,75000,98000,160,null,"CS2 7500-59"]
["Non Adjustable","CS2 7500",7500,60,0.10500000000000001,80,25,150,60,60,240,75000,98000,160,null,"CS2 7500-60"]
["Non Adjustable","CS2 7500",7500,61,0.10500000000000001,80,25,150,61,61,241,75000,98000,160,null,"CS2 7500-61"]
["Non Adjustable","CS2 7500",7500,62,0.10500000000000001,80,25,150,62,62,242,75000,98000,160,null,"CS2 7500-62"]
["Non Adjustable","CS2 7500",7500,63,0.10500000000000001,80,25,150,63,63,243,75000,98000,160,null,"CS2 7500-63"]
["Non Adjustable","CS2 7500",7500,64,0.10500000000000001,80,25,150,64,64,244,75000,98000,160,null,"CS2 7500-64"]
["Non Adjustable","CS2 7500",7500,65,0.10500000000000001,80,25,150,65,65,245,75000,98000,160,null,"CS2 7500-65"]
["Non Adjustable","CS2 7500",7500,66,0.10500000000000001,80,25,150,66,66,246,75000,98000,160,null,"CS2 7500-66"]
["Non Adjustable","CS2 7500",7500,67,0.10500000000000001,80,25,150,67,67,247,75000,98000,160,null,"CS2 7500-67"]
["Non Adjustable","CS2 7500",7500,68,0.10500000000000001,80,25,150,68,68,248,75000,98000,160,null,"CS2 7500-68"]
["Non Adjustable","CS2 7500",7500,69,0.10500000000000001,80,25,150,69,69,249,75000,98000,160,null,"CS2 7500-69"]
["Non Adjustable","CS2 7500",7500,70,0.10500000000000001,80,25,150,{"$f":"D594","v":70},{"$f":"D594","v":70},250,75000,98000,160,null,"CS2 7500-70"]
["Non Adjustable","CS2 7500",7500,71,0.10500000000000001,80,25,150,71,71,251,75000,98000,160,null,"CS2 7500-71"]
["Non Adjustable","CS2 7500",7500,72,0.10500000000000001,80,25,150,72,72,252,75000,98000,160,null,"CS2 7500-72"]
["Non Adjustable","CS2 7500",7500,73,0.10500000000000001,80,25,150,73,73,253,75000,98000,160,null,"CS2 7500-73"]
["Non Adjustable","CS2 7500",7500,74,{"$f":"AVERAGE(0.13,0.08)","v":0.10500000000000001},80,25,150,74,74,254,75000,98000,160,null,"CS2 7500-74"]
["Non Adjustable","CS2 7500",7500,75,0.10500000000000001,80,25,150,75,75,{"$f":"180+D599","v":255},75000,98000,160,null,"CS2 7500-75"]
["Non Adjustable","CS2 7500",7500,76,0.10500000000000001,80,25,150,76,76,256,75000,98000,160,null,"CS2 7500-76"]
["Non Adjustable","CS2 7500",7500,77,0.10500000000000001,80,25,150,77,77,257,75000,98000,160,null,"CS2 7500-77"]
["Non Adjustable","CS2 7500",7500,78,0.10500000000000001,80,25,150,78,78,258,75000,98000,160,null,"CS2 7500-78"]
["Non Adjustable","CS2 7500",7500,79,0.10500000000000001,80,25,150,79,79,259,75000,98000,160,null,"CS2 7500-79"]
["Non Adjustable","CS2 7500",7500,80,0.10500000000000001,80,25,150,80,80,260,75000,98000,160,null,"CS2 7500-80"]
["Non Adjustable","CS2 7500",7500,81,0.10500000000000001,80,25,150,81,81,261,75000,98000,160,null,"CS2 7500-81"]
["Non Adjustable","CS2 7500",7500,82,0.10500000000000001,80,25,150,82,82,262,75000,98000,160,null,"CS2 7500-82"]
["Non Adjustable","CS2 7500",7500,83,0.10500000000000001,80,25,150,83,83,263,75000,98000,160,null,"CS2 7500-83"]
["Non Adjustable","CS2 7500",7500,84,0.10500000000000001,80,25,150,84,84,264,75000,98000,160,null,"CS2 7500-84"]
["Non Adjustable","CS2 7500",7500,85,0.10500000000000001,80,25,150,85,85,265,75000,98000,160,null,"CS2 7500-85"]
["Non Adjustable","CS2 7500",7500,86,0.10500000000000001,80,25,150,86,86,266,75000,98000,160,null,"CS2 7500-86"]
["Non Adjustable","CS2 7500",7500,87,0.10500000000000001,80,25,150,87,87,267,75000,98000,160,null,"CS2 7500-87"]
["Non Adjustable","CS2 7500",7500,88,0.10500000000000001,80,25,150,88,88,268,75000,98000,160,null,"CS2 7500-88"]
["Non Adjustable","CS2 7500",7500,89,0.10500000000000001,80,25,150,89,89,269,75000,98000,160,null,"CS2 7500-89"]
["Non Adjustable","CS2 7500",7500,90,0.10500000000000001,80,25,150,90,90,270,75000,98000,160,null,"CS2 7500-90"]
["Non Adjustable","CS2 7500",7500,91,0.10500000000000001,80,25,150,91,91,271,75000,98000,160,null,"CS2 7500-91"]
["Non Adjustable","CS2 7500",7500,92,0.10500000000000001,80,25,150,92,92,272,75000,98000,160,null,"CS2 7500-92"]
["Non Adjustable","CS2 7500",7500,93,0.10500000000000001,80,25,150,93,93,273,75000,98000,160,null,"CS2 7500-93"]
["Non Adjustable","CS2 7500",7500,94,0.10500000000000001,80,25,150,94,94,274,75000,98000,160,null,"CS2 7500-94"]
["Non Adjustable","CS2 7500",7500,95,0.10500000000000001,80,25,150,95,95,275,75000,98000,160,null,"CS2 7500-95"]
["Non Adjustable","CS2 7500",7500,96,0.10500000000000001,80,25,150,96,96,276,75000,98000,160,null,"CS2 7500-96"]
["Non Adjustable","CS2 7500",7500,97,0.10500000000000001,80,25,150,97,97,277,75000,98000,160,null,"CS2 7500-97"]
["Non Adjustable","CS2 7500",7500,98,0.10500000000000001,80,25,150,98,98,278,75000,98000,160,null,"CS2 7500-98"]
["Non Adjustable","CS2 7500",7500,99,0.10500000000000001,80,25,150,99,99,279,75000,98000,160,null,"CS2 7500-99"]
["Non Adjustable","CS2 7500",7500,100,0.10500000000000001,80,25,150,100,100,280,75000,98000,160,null,"CS2 7500-100"]
["Non Adjustable","CS2 7500",7500,101,0.10500000000000001,80,25,150,101,101,281,75000,98000,160,null,"CS2 7500-101"]
["Non Adjustable","CS2 7500",7500,102,0.10500000000000001,80,25,150,102,102,282,75000,98000,160,null,"CS2 7500-102"]
["Non Adjustable","CS2 7500",7500,103,0.10500000000000001,80,25,150,103,103,283,75000,98000,160,null,"CS2 7500-103"]
["Non Adjustable","CS2 7500",7500,104,0.10500000000000001,80,25,150,104,104,284,75000,98000,160,null,"CS2 7500-104"]
["Non Adjustable","CS2 7500",7500,105,0.10500000000000001,80,25,150,105,105,285,75000,98000,160,null,"CS2 7500-105"]
["Non Adjustable","CS2 7500",7500,106,0.10500000000000001,80,25,150,106,106,286,75000,98000,160,null,"CS2 7500-106"]
["Non Adjustable","CS2 7500",7500,107,0.10500000000000001,80,25,150,107,107,287,75000,98000,160,null,"CS2 7500-107"]
["Non Adjustable","CS2 7500",7500,108,0.10500000000000001,80,25,150,108,108,288,75000,98000,160,null,"CS2 7500-108"]
["Non Adjustable","CS2 7500",7500,109,0.10500000000000001,80,25,150,109,109,289,75000,98000,160,null,"CS2 7500-109"]
["Non Adjustable","CS2 7500",7500,110,0.10500000000000001,80,25,150,110,110,290,75000,98000,160,null,"CS2 7500-110"]
["Non Adjustable","CS2 7500",7500,111,0.10500000000000001,80,25,150,111,111,291,75000,98000,160,null,"CS2 7500-111"]
["Non Adjustable","CS2 7500",7500,112,0.10500000000000001,80,25,150,112,112,292,75000,98000,160,null,"CS2 7500-112"]
["Non Adjustable","CS2 7500",7500,113,0.10500000000000001,80,25,150,113,113,293,75000,98000,160,null,"CS2 7500-113"]
["Non Adjustable","CS2 7500",7500,114,0.10500000000000001,80,25,150,114,114,294,75000,98000,160,null,"CS2 7500-114"]
["Non Adjustable","CS2 7500",7500,115,0.10500000000000001,80,25,150,115,115,295,75000,98000,160,null,"CS2 7500-115"]
["Non Adjustable","CS2 7500",7500,116,0.10500000000000001,80,25,150,116,116,296,75000,98000,160,null,"CS2 7500-116"]
["Non Adjustable","CS2 7500",7500,117,0.10500000000000001,80,25,150,117,117,297,75000,98000,160,null,"CS2 7500-117"]
["Non Adjustable","CS2 7500",7500,118,0.10500000000000001,80,25,150,118,118,298,75000,98000,160,null,"CS2 7500-118"]
["Non Adjustable","CS2 7500",7500,119,0.10500000000000001,80,25,150,119,119,299,75000,98000,160,null,"CS2 7500-119"]
["Non Adjustable","CS2 7500",7500,120,0.10500000000000001,80,25,150,120,120,300,75000,98000,160,null,"CS2 7500-120"]
["Non Adjustable","CS2 7500",7500,121,0.10500000000000001,80,25,150,121,121,301,75000,98000,160,null,"CS2 7500-121"]
["Non Adjustable","CS2 7500",7500,122,0.10500000000000001,80,25,150,122,122,302,75000,98000,160,null,"CS2 7500-122"]
["Non Adjustable","CS2 7500",7500,123,0.10500000000000001,80,25,150,123,123,303,75000,98000,160,null,"CS2 7500-123"]
["Non Adjustable","CS2 7500",7500,124,0.10500000000000001,80,25,150,124,124,304,75000,98000,160,null,"CS2 7500-124"]
["Non Adjustable","CS2 7500",7500,125,0.10500000000000001,80,25,150,125,125,305,75000,98000,160,null,"CS2 7500-125"]
["Non Adjustable","CS2 7500",7500,126,0.10500000000000001,80,25,150,126,126,306,75000,98000,160,null,"CS2 7500-126"]
["Non Adjustable","CS2 7500",7500,127,0.10500000000000001,80,25,150,127,127,307,75000,98000,160,null,"CS2 7500-127"]
["Non Adjustable","CS2 7500",7500,128,0.10500000000000001,80,25,150,128,128,308,75000,98000,160,null,"CS2 7500-128"]
["Non Adjustable","CS2 7500",7500,129,0.10500000000000001,80,25,150,129,129,309,75000,98000,160,null,"CS2 7500-129"]
["Non Adjustable","CS2 7500",7500,130,0.10500000000000001,80,25,150,130,130,310,75000,98000,160,null,"CS2 7500-130"]
["Non Adjustable","CS2 7500",7500,131,0.10500000000000001,80,25,150,131,131,311,75000,98000,160,null,"CS2 7500-131"]
["Non Adjustable","CS2 7500",7500,132,0.10500000000000001,80,25,150,132,132,312,75000,98000,160,null,"CS2 7500-132"]
["Non Adjustable","CS2 7500",7500,133,0.10500000000000001,80,25,150,133,133,313,75000,98000,160,null,"CS2 7500-133"]
["Non Adjustable","CS2 7500",7500,134,0.10500000000000001,80,25,150,{"$f":"D658","v":134},{"$f":"D658","v":134},314,75000,98000,160,null,"CS2 7500-134"]
["Non Adjustable","CS2 7500",7500,135,0.10500000000000001,80,25,150,135,135,315,75000,98000,160,null,"CS2 7500-135"]
["Non Adjustable","CS2 7500",7500,136,0.10500000000000001,80,25,150,136,136,316,75000,98000,160,null,"CS2 7500-136"]
["Non Adjustable","CS2 7500",7500,137,0.10500000000000001,80,25,150,137,137,317,75000,98000,160,null,"CS2 7500-137"]
["Non Adjustable","CS2 7500",7500,138,{"$f":"AVERAGE(0.13,0.08)","v":0.10500000000000001},80,25,150,138,138,318,75000,98000,160,null,"CS2 7500-138"]
["Non Adjustable","CS2 7500",7500,139,0.10500000000000001,80,25,150,139,139,{"$f":"180+D663","v":319},75000,98000,160,null,"CS2 7500-139"]
["Non Adjustable","CS2 7500",7500,140,0.10500000000000001,80,25,150,140,140,320,75000,98000,160,null,"CS2 7500-140"]
["Non Adjustable","CS2 7500",7500,141,0.10500000000000001,80,25,150,141,141,321,75000,98000,160,null,"CS2 7500-141"]
["Non Adjustable","CS2 7500",7500,142,0.10500000000000001,80,25,150,142,142,322,75000,98000,160,null,"CS2 7500-142"]
["Non Adjustable","CS2 7500",7500,143,0.10500000000000001,80,25,150,143,143,323,75000,98000,160,null,"CS2 7500-143"]
["Non Adjustable","CS2 7500",7500,144,0.10500000000000001,80,25,150,144,144,324,75000,98000,160,null,"CS2 7500-144"]
["Non Adjustable","CS2 7500",7500,145,0.10500000000000001,80,25,150,145,145,325,75000,98000,160,null,"CS2 7500-145"]
["Non Adjustable","CS2 7500",7500,146,0.10500000000000001,80,25,150,146,146,326,75000,98000,160,null,"CS2 7500-146"]
["Non Adjustable","CS2 7500",7500,147,0.10500000000000001,80,25,150,147,147,327,75000,98000,160,null,"CS2 7500-147"]
["Non Adjustable","CS2 7500",7500,148,0.10500000000000001,80,25,150,148,148,328,75000,98000,160,null,"CS2 7500-148"]
["Non Adjustable","CS2 7500",7500,149,0.10500000000000001,80,25,150,149,149,329,75000,98000,160,null,"CS2 7500-149"]
["Non Adjustable","CS2 7500",7500,150,0.10500000000000001,80,25,150,150,150,330,75000,98000,160,null,"CS2 7500-150"]
["Non Adjustable","CS2 7500",7500,151,0.10500000000000001,80,25,150,151,151,331,75000,98000,160,null,"CS2 7500-151"]
["Non Adjustable","CS2 7500",7500,152,0.10500000000000001,80,25,150,152,152,332,75000,98000,160,null,"CS2 7500-152"]
["Non Adjustable","CS2 7500",7500,153,0.10500000000000001,80,25,150,153,153,333,75000,98000,160,null,"CS2 7500-153"]
["Non Adjustable","CS2 7500",7500,154,0.10500000000000001,80,25,150,154,154,334,75000,98000,160,null,"CS2 7500-154"]
["Non Adjustable","CS2 7500",7500,155,0.10500000000000001,80,25,150,155,155,335,75000,98000,160,null,"CS2 7500-155"]
["Non Adjustable","CS2 7500",7500,156,0.10500000000000001,80,25,150,156,156,336,75000,98000,160,null,"CS2 7500-156"]
["Non Adjustable","CS2 7500",7500,157,0.10500000000000001,80,25,150,157,157,337,75000,98000,160,null,"CS2 7500-157"]
["Non Adjustable","CS2 7500",7500,158,0.10500000000000001,80,25,150,158,158,338,75000,98000,160,null,"CS2 7500-158"]
["Non Adjustable","CS2 7500",7500,159,0.10500000000000001,80,25,150,159,159,339,75000,98000,160,null,"CS2 7500-159"]
["Non Adjustable","CS2 7500",7500,160,0.10500000000000001,80,25,150,160,160,340,75000,98000,160,null,"CS2 7500-160"]

{"sheet":"Length_Adjustment","index":2,"n_rows":19,"n_cols":10,"rows_kept":19,"cut":false,"hidden":true,"merged":[]}
[]
[]
["Adjustment",1,2,4,8,null,null,null,"Spacer (1 mm)",{"$f":"VLOOKUP(Stroke_adjustment,Adjustment,2)","v":0}]
[-8,1,1,1,1,null,null,null,"Spacer (2 mm)",{"$f":"VLOOKUP(Stroke_adjustment,Adjustment,3)","v":0}]
[-7,0,1,1,1,null,null,null,"Spacer (4 mm)",{"$f":"VLOOKUP(Stroke_adjustment,Adjustment,4)","v":1}]
[-6,1,0,1,1,null,null,null,"Spacer (8 mm)",{"$f":"VLOOKUP(Stroke_adjustment,Adjustment,5)","v":1}]
[-5,0,0,1,1]
[-4,1,1,0,1]
[-3,0,1,0,1]
[-2,1,0,0,1]
[-1,0,0,0,1]
[0,1,1,1,0]
[1,0,1,1,0]
[2,1,0,1,0]
[3,0,0,1,0]
[4,1,1,0,0]
[5,0,1,0,0]
[6,1,0,0,0]
[7,0,0,0,0]

{"sheet":"Heat_Factor","index":3,"n_rows":98,"n_cols":22,"rows_kept":98,"cut":false,"hidden":true,"merged":[]}
[]
[null,null,null,"Max Heat factors from Catalogue (150 bar)",null,null,null,null,null,"Max Heat Factors for User_Used Charge pressue"]
[null,null,"Max Heatfactor without cooling catalogue",null,"Max Heatfactor without cooling OBS k och m ska tas från Figurer nedan","Liquid Cooling","Nitro Cooler",null,"Force_Size","Max Heatfactor without cooling","Liquid Cooling","Nitro Cooler"]
[null,null,380,1500,{"$f":"-0.2669*User_Used_Stroke_Length+422.71","v":421.37549999999999},{"$f":"2000*Temperature_Reducing_Factor","v":2142.8571428571427},{"$f":"3200*Temperature_Reducing_Factor","v":3428.5714285714284},"mm/min",{"$f":"D4","v":1500},{"$f":"E4/$E$12","v":421.37549999999999},2142.8571428571427,3428.5714285714284,"mm/min"]
[null,null,320,3000,{"$f":"-0.94*User_Used_Stroke_Length+374.02","v":369.32},{"$f":"1200*Temperature_Reducing_Factor","v":1285.7142857142858},{"$f":"2100*Temperature_Reducing_Factor","v":2250},"mm/min",{"$f":"D5","v":3000},369.32,1285.7142857142858,2250,"mm/min"]
[null,null,300,5000,{"$f":"-0.8882*User_Used_Stroke_Length+328.82","v":324.37900000000002},{"$f":"1100*Temperature_Reducing_Factor","v":1178.5714285714284},{"$f":"1500*Temperature_Reducing_Factor","v":1607.1428571428571},"mm/min",5000,324.37900000000002,1178.5714285714284,1607.1428571428571,"mm/min"]
[null,null,280,7500,{"$f":"-0.8882*User_Used_Stroke_Length+308.82","v":304.37900000000002},{"$f":"1000*Temperature_Reducing_Factor","v":1071.4285714285713},{"$f":"1200*Temperature_Reducing_Factor","v":1285.7142857142858},"mm/min",7500,304.37900000000002,1071.4285714285713,1285.7142857142858,"mm/min"]
[null,null,null,null,"Stroke Length depenende Heta Factor 2019-09-02","2019-09-02 Temp reducing"]
[null,null,null,null,null,null,null,null,null,null,null,null,null,null,null,null,{"$f":"IF(Q4=1,\"Liquid Cooler\",IF(Q5=0,\"\",\"Nitro Cooler\"))","v":""}]
[null,null,null,null,null,null,null,null,null,null,null,null,null,null,null,null,null,null,{"$f":"IF(Q4=1,\"Nitro Cooler\",\"\")","v":""}]
[null,null,null,null,null,null,null,null,null,null,null,"Heat Data"]
[null,null,null,"Charging Pressure Utilisation",{"$f":"User_Charge_Pressure/150","v":1},"(-)",null,null,null,null,null,"Heat Factor",{"$f":"User_Strokes_per_Minute*User_Used_Stroke_Length","v":50},"[mm/min]"]
[null,null,null,"Work / Stroke at 20 C",{"$f":"Total_Work_20","v":90.299629294703934},"Nm",null,null,null,null,null,"Total Power",{"$f":"E20/1000","v":1.8131836826524736E-2},"kW"]
[null,null,null,"Work / Stroke at 80 C",{"$f":"Total_Work_80","v":108.79102095914843},"Nm"]
[null,null,null,"Seconds per stroke",{"$f":"60/User_Strokes_per_Minute","v":6},null,null,"Code","Flag","Code*Flag","Rang",null,"Max Heat Factor [mm/min]","Max Power kW","Utilisation",null,null,null,null,null,null,"Cell-länk ListBox_Cooling"]
[null,null,null,null,null,null,null,1,{"$f":"IF(Heat_Factor<=$M16,1,0)","v":1},{"$f":"IF(I16=0,\" \",H16*I16)","v":1},{"$f":"IF(ISNUMBER(J16),RANK(J16,$J$16:$J$18,1),\"\")","v":1},"No cooling",{"$f":"VLOOKUP(Force_Size,Heat_Factor_Matrix,2)","v":421.37549999999999},{"$f":"((M16/Heat_Factor)*$E$20)/1000","v":0.15280623617390549},{"$f":"Heat_Factor/M16","v":0.11865901078729067},{"$f":"IF(I16=1,\"OK\",\"Not OK\")","v":"OK"},{"$f":"IF(E30=0,\"No Cooling Alternative\",VLOOKUP(H16,$K$16:$L$18,2,FALSE))","v":"No cooling"},{"$f":"IFERROR(Q16,\" \")","v":"No cooling"},{"$f":"OFFSET(R15,V16,0,1,1)","v":"No cooling"},null,null,1]
[null,null,null,null,null,null,null,2,{"$f":"IF(Heat_Factor<=$M17,1,0)","v":1},{"$f":"IF(I17=0,\" \",H17*I17)","v":2},{"$f":"IF(ISNUMBER(J17),RANK(J17,$J$16:$J$18,1),\"\")","v":2},"Liquid Cooling",{"$f":"VLOOKUP(Force_Size,Heat_Factor_Matrix,3)","v":2142.8571428571427},{"$f":"((M17/Heat_Factor)*$E$20)/1000","v":0.77707872113677434},{"$f":"Heat_Factor/M17","v":2.3333333333333334E-2},{"$f":"IF(I17=1,\"OK\",\"Not OK\")","v":"OK"},{"$f":"VLOOKUP(H17,$K$16:$L$18,2,FALSE)","v":"Liquid Cooling"},{"$f":"IFERROR(Q17,\" \")","v":"Liquid Cooling"}]
[null,null,null,null,null,null,null,3,{"$f":"IF(AND(Heat_Factor<$M18,Ext_Cooling_per_spring<=1.5),1,0)","v":1},{"$f":"IF(I18=0,\" \",H18*I18)","v":3},{"$f":"IF(ISNUMBER(J18),RANK(J18,$J$16:$J$18,1),\"\")","v":3},"Nitro Cooler",{"$f":"VLOOKUP(Force_Size,Heat_Factor_Matrix,4)","v":3428.5714285714284},{"$f":"((M18/Heat_Factor)*$E$20)/1000","v":1.243325953818839},{"$f":"Heat_Factor/M18","v":1.4583333333333334E-2},{"$f":"IF(I18=1,\"OK\",\"Not OK\")","v":"OK"},"Nitro Cooler","Nitro Cooler"]
[null,null,null,"Power at 20 C",{"$f":"E13/Seconds_per_stroke","v":15.049938215783989},"W [Nm/s]"]
[null,null,null,"Power at 80 C",{"$f":"E14/Seconds_per_stroke","v":18.131836826524736},"W [Nm/s]"]
[null,null,null,null,null,null,null,1,{"$f":"I16","v":1},{"$f":"IF(I21=0,\" \",H21*I21)","v":1},{"$f":"IF(ISNUMBER(J21),RANK(J21,$J$21:$J$23,1),\"\")","v":1}," ",null,null,null,null,{"$f":"VLOOKUP(H21,$K$21:$L$23,2,FALSE)","v":" "},{"$f":"IFERROR(Q21,\" \")","v":" "},{"$f":"OFFSET(R20,V16,0,1,1)","v":" "}]
[null,null,null,null,{"$f":"User_Strokes_per_Minute*User_Used_Stroke_Length","v":50},null,null,2,{"$f":"I17","v":1},{"$f":"IF(I22=0,\" \",H22*I22)","v":2},{"$f":"IF(ISNUMBER(J22),RANK(J22,$J$21:$J$23,1),\"\")","v":2},"-CJ",null,null,null,null,{"$f":"VLOOKUP(H22,$K$21:$L$23,2,FALSE)","v":"-CJ"},{"$f":"IFERROR(Q22,\" \")","v":"-CJ"}]
[null,null,null,null,null,null,null,3,{"$f":"I18","v":1},3,{"$f":"IF(ISNUMBER(J23),RANK(J23,$J$21:$J$23,1),\"\")","v":3},"-NC",null,null,null,null,{"$f":"VLOOKUP(H23,$K$21:$L$23,2,FALSE)","v":"-NC"},{"$f":"IFERROR(Q23,\" \")","v":"-NC"}]
[]
[]
[null,null,null,null,null,null,null,"Surrounding temperature 2019-09-02"]
[null,null,null,null,null,null,null,null,null,null,null,"Max allowed temperature",null,80,"°C"]
[null,null,null,"External Cooling need",{"$f":"Ext_Cooling_Need","v":0},"Kw",null,null,null,null,null,"Reference temperature",null,24,"°C"]
[null,null,null,"External cooling per spring",{"$f":"Ext_Cooling_per_spring","v":0},"kw"]
[null,null,null,"Cooling Altenatives",{"$f":"Cooling_Ant","v":3}]
[]
[null,null,null,"Nitro Cooler",{"$f":"E28/Nitro_Cooler_Capacity","v":0},"Antal",null,null,null,null,null,"New Heat Data 20190830"]
[null,null,null,null,{"$f":"_xlfn.CEILING.PRECISE(E32)","v":0},"Antal Rundat",null,null,null,null,null,"No cooling",null,{"$f":"N16*1000/($N$27-$N$28)","v":2.7286827888197407},"W/°C"]
[null,null,null,null,{"$f":"IF(E28=0,\"No Nitro Cooler needed\",IF(E33>4,CONCATENATE(E33,\" Nitro Coolers needed. Maximum 4 Nitro Coolers recomended\"),IF(E33=1,\"One Nitro Cooler needed\",CONCATENATE(E33,\" Nitro Coolers needed\"))))","v":"No Nitro Cooler needed"},2021641,{"$f":"E33","v":0},null,null,null,null,"Liquid Cooling",null,{"$f":"N17*1000/($N$27-$N$28)","v":13.876405734585257},"W/°C"]
[null,null,null,null,null,null,null,null,null,null,null,"Nitro Cooler",null,22.202249175336412,"W/°C"]
[null,null,null,"Liquid Cooler",{"$f":"IF(E28=0,\"No Liquid Cooler needed\",IF(E28<=Liquid_Cooler_10kW_Capacity,\"One 10 kW Cooler Unit needed\",IF(E28<=Liquid_Cooler_25kW_Capacity,\"One 25 kW Cooler Unit needed\",\"Too much Heat generated\")))","v":"No Liquid Cooler needed"},{"$f":"IF(E28<=10,\"CS-CU-10KW\",IF(E28<=25,\"CS-CU-25KW\",\"\"))","v":"CS-CU-10KW"},{"$f":"IF(E28=0,0,1)","v":0}]
[null,null,null,null,null,null,null,null,null,null,null,"Temperature Reducing Factor",null,{"$f":"($N$27-User_Surrounding_Temperature)/($N$27-$N$28)","v":1.0714285714285714}]
[null,null,null,"Nitro Cooler message",{"$f":"IF(Cooler=\"-NC\",E34,IF(Cooler=\"-CJ\",E36,\"\"))","v":""},{"$f":"IF(Cooler=\"-NC\",F34,IF(Cooler=\"-CJ\",F36,\"\"))","v":""},{"$f":"IF(Cooler=\"-NC\",G34,IF(Cooler=\"-CJ\",G36,\"\"))","v":""},null,null,null,null,"Heat Data reduced"]
[null,null,null,null,{"$f":"IF(Cooler=\"-NC\",\"Nitro Cooler\",IF(Cooler=\"-CJ\",\"Liquid Cooler Unit\",\"No Cooler\"))","v":"No Cooler"},null,null,null,null,null,null,"Heat Factor",{"$f":"Heat_Factor","v":50},"mm/min"]
[null,null,null,null,null,null,null,null,null,null,null,"Total Power",{"$f":"Total_Power","v":1.8131836826524736E-2},"kW"]
[]
[null,null,null,null,null,null,null,"Code","Flag","Code*Flag","Rang",null,"Max Heat Factor mm/min","Max Power kW","Utilisation"]
[null,null,null,null,null,null,null,1,{"$f":"IF(Heat_Factor<=$M43,1,0)","v":1},{"$f":"IF(I43=0,\" \",H43*I43)","v":1},{"$f":"IF(ISNUMBER(J43),RANK(J43,$J$43:$J$45,1),\"\")","v":1},"No cooling",{"$f":"M16*Temperature_Reducing_Factor","v":451.47375},0.16372096732918445,{"$f":"Heat_Factor/M43","v":0.11074841006813796},{"$f":"IF(I43=1,\"OK\",\"Not OK\")","v":"OK"},null,null,{"$f":"IF(E30=0,\"No Cooling Alternative\",VLOOKUP(H43,$K$43:$L$45,2,FALSE))","v":"No cooling"},{"$f":"IFERROR(S43,\" \")","v":"No cooling"},{"$f":"OFFSET(T42,V16,0,1,1)","v":"No cooling"}]
[null,null,null,null,null,null,null,2,{"$f":"IF(Heat_Factor<=$M44,1,0)","v":1},{"$f":"IF(I44=0,\" \",H44*I44)","v":2},{"$f":"IF(ISNUMBER(J44),RANK(J44,$J$43:$J$45,1),\"\")","v":2},"Liquid cooling",2295.9183673469383,0.83258434407511539,{"$f":"Heat_Factor/M44","v":2.1777777777777781E-2},{"$f":"IF(I44=1,\"OK\",\"Not OK\")","v":"OK"},null,null,{"$f":"VLOOKUP(H44,$K$43:$L$45,2,FALSE)","v":"Liquid cooling"},{"$f":"IFERROR(S44,\" \")","v":"Liquid cooling"}]
[null,null,null,null,null,null,null,3,{"$f":"IF(AND(Heat_Factor<$M45,Ext_Cooling_per_spring<=Nitro_Cooler_Capacity),1,0)","v":1},{"$f":"IF(I45=0,\" \",H45*I45)","v":3},{"$f":"IF(ISNUMBER(J45),RANK(J45,$J$43:$J$45,1),\"\")","v":3},"Nitro Cooler",3673.4693877551017,1.3321349505201847,{"$f":"Heat_Factor/M45","v":1.3611111111111112E-2},{"$f":"IF(I45=1,\"OK\",\"Not OK\")","v":"OK"},null,null,{"$f":"VLOOKUP(H45,$K$43:$L$45,2,FALSE)","v":"Nitro Cooler"},"Nitro Cooler"]
[]
[null,null,"Nytt 190903","Nitro Cooler Capacity",{"$f":"1.5*Temperature_Reducing_Factor","v":1.6071428571428572}]
[null,null,null,"Liquid Cooler 10kW Capacity",{"$f":"10*Temperature_Reducing_Factor","v":10.714285714285714},null,null,1,{"$f":"I43","v":1},{"$f":"IF(I48=0,\" \",H48*I48)","v":1},{"$f":"IF(ISNUMBER(J48),RANK(J48,$J$48:$J$50,1),\"\")","v":1},null,null,null,null,null,{"$f":"VLOOKUP(H48,$K$48:$L$50,2,FALSE)","v":0},{"$f":"IFERROR(Q48,\" \")","v":0},{"$f":"OFFSET(R47,V16,0,1,1)","v":0}]
[null,null,null,"Liquid Cooler 25kW Capacity",{"$f":"25*Temperature_Reducing_Factor","v":26.785714285714285},null,null,2,{"$f":"I44","v":1},{"$f":"IF(I49=0,\" \",H49*I49)","v":2},{"$f":"IF(ISNUMBER(J49),RANK(J49,$J$48:$J$50,1),\"\")","v":2},"-CJ",null,null,null,null,{"$f":"VLOOKUP(H49,$K$48:$L$50,2,FALSE)","v":"-CJ"},{"$f":"IFERROR(Q49,\" \")","v":"-CJ"}]
[null,null,null,null,null,null,null,3,{"$f":"I45","v":1},3,{"$f":"IF(ISNUMBER(J50),RANK(J50,$J$48:$J$50,1),\"\")","v":3},"-NC",null,null,null,null,{"$f":"VLOOKUP(H50,$K$48:$L$50,2,FALSE)","v":"-NC"},"-NC"]
[]
[]
[]
[]
[]
[]
[]
[]
[]
[]
[]
[]
[]
[]
[]
[]
[]
[]
[]
[]
[]
[]
[]
[]
[]
[]
[]
[]
[]
[]
[null,null,null,null,null,"Stroke","KF1500","KF3000","KF5000","KF7500"]
[null,null,null,null,null,0,423,374,329,309]
[null,null,null,null,null,10,420,365,320,300]
[null,null,null,null,null,20,417,355,311,291]
[null,null,null,null,null,30,415,346,302,282]
[null,null,null,null,null,40,412,336,293,273]
[null,null,null,null,null,50,409,327,284,264]
[null,null,null,null,null,60,407,318,276,256]
[null,null,null,null,null,70,404,308,267,247]
[null,null,null,null,null,80,401,299,258,238]
[null,null,null,null,null,90,399,289,249,229]
[null,null,null,null,null,100,396,280,240,220]
[null,null,null,null,null,110,393,271,231,211]
[null,null,null,null,null,120,391,261,222,202]
[null,null,null,null,null,130,388,252,213,193]
[null,null,null,null,null,140,385,242,204,184]
[null,null,null,null,null,150,383,233,196,176]
[null,null,null,null,null,160,380,224,187,167]

{"sheet":"Fjäderkurva","index":4,"n_rows":67,"n_cols":38,"rows_kept":67,"cut":false,"hidden":true,"merged":[]}
[null,null,"Ändring"]
[null,null,"2016-06-07"]
[]
[]
[]
[]
[null,null,null,null,"Input från annan flik",null,null,null,null,null,null,"Virtuell slagvolym"]
[]
[null,null,"Fi",{"$f":"Fi","v":15000},"N","Initialkraft vid 20 °C",null,null,null,null,null,"Kurva",null,null,null,null,"Iso t kraft per fj"]
[null,null,"Fs",{"$f":"Fs","v":22000},"N","Detta är isoterm kraftökning",null,null,null,null,null,null,"Slag (mm)","Virtuell volym","Vi / Vf","(Vi / Vf)^kappa","kN eller lbf","Isothermal force at 20 °C","Isothermal force at estimated running temperature","Polytrop kraft per fjäder","Polytropic force at 20 °C","Polytropic force at estimated running temperature",null,null,null,null,"Driftstemperatur",null,null,null,null,null,"Isothermal force at 20 °C","Isothermal force at estimated running temperature"]
[null,null,"slagl",{"$f":"User_Used_Stroke_Length","v":5},"mm",null,null,null,null,null,null,0,{"$f":"L11*$D$14","v":0},{"$f":"$D$26-M11","v":15.714285714285717},{"$f":"$D$26/N11","v":1},{"$f":"O11^$D$35","v":1},{"$f":"$D$45*O11","v":15},{"$f":"Q11*$D$15","v":15},{"$f":"R11*$AA$17","v":18.071672354948806},{"$f":"$D$45*P11","v":15},{"$f":"$D$15*T11","v":15},{"$f":"U11*$AA$17","v":18.071672354948806},null,null,null,null,80,null,null,null,null,{"$f":"OFFSET(Q11,0,$C$67)","v":15},{"$f":"OFFSET(R11,0,$C$67)","v":15},{"$f":"OFFSET(S11,0,$C$67)","v":18.071672354948806}]
[null,null,"Utnyttjad slagl",{"$f":"User_Used_Stroke_Length","v":5},"mm",null,null,null,null,null,null,0.1,0.5,15.214285714285717,1.0328638497652582,1.0463098368307167,15.492957746478874,15.492957746478874,18.665577080228815,15.694647552460751,15.694647552460751,{"$f":"U12*$AA$17","v":18.908568552964656},null,null,null,null,80,null,null,null,null,{"$f":"OFFSET(Q12,0,$C$67)","v":15.492957746478874},{"$f":"OFFSET(R12,0,$C$67)","v":15.492957746478874},18.665577080228815,null,{"$f":"AVERAGE(AG11:AG12)*(M12-M11)","v":7.623239436619718},{"$f":"(AVERAGE(AH11:AH12)*(M12-M11))","v":9.1843123587944042}]
[null,null,"Använd slaglängd ev reducerad till max",{"$f":"User_Used_Stroke_Length","v":5},"mm",null,null,null,null,null,null,0.2,1,14.714285714285717,1.0679611650485437,1.0964217562360852,16.019417475728154,16.019417475728154,19.299844262566683,16.446326343541276,16.446326343541276,19.814174741536075,null,null,null,null,"Medel",null,null,null,null,16.019417475728154,16.019417475728154,19.299844262566683,null,{"$f":"AVERAGE(AG12:AG13)*(M13-M12)","v":7.8780938055517566},{"$f":"(AVERAGE(AH12:AH13)*(M13-M12))","v":9.4913553356988736}]
[null,null,"utnyttjad slagl mm",{"$f":"User_Used_Stroke_Length","v":5},"mm",null,null,null,null,null,null,0.3,1.5,14.214285714285717,1.1055276381909547,1.1507936218050674,16.582914572864318,16.582914572864318,19.978733256727317,17.26190432707601,17.26190432707601,20.796765281426044,null,null,null,null,{"$f":"IFERROR((AA11+AA12)*0.5,20)","v":80},null,null,null,null,16.582914572864318,16.582914572864318,19.978733256727317,null,8.1505830121481182,9.8196443798235009]
[null,null,"Antal fjädrar",{"$f":"User_Number_of_Springs","v":1},"st",null,null,null,null,null,null,0.4,2,13.714285714285717,1.1458333333333333,1.2099572689339122,17.1875,17.1875,20.707124573378838,18.149359034008683,18.149359034008683,21.865951327662337,null,null,null,null,null,null,null,null,null,17.1875,17.1875,20.707124573378838,null,8.4426036432160796,10.17146445752654]
[null,null,"Status tryckenhet",1,"bar",null,null,null,null,null,null,0.5,2.5,13.214285714285717,1.1891891891891893,1.2745337300246184,17.837837837837839,17.837837837837839,21.490637395074256,19.118005950369277,19.118005950369277,23.032955974335682,null,null,null,null,"ktemp (273+T)/(237+20)",null,null,null,null,17.837837837837839,17.837837837837839,21.490637395074256,null,8.7563344594594597,10.549440492113273]
[null,null,"Status kraftenhet",1,"kN",null,null,null,null,null,null,0.6,3,12.714285714285717,1.2359550561797752,1.3452523206887339,18.539325842696627,18.539325842696627,22.335774820723238,20.17878481033101,20.17878481033101,24.310959174221317,null,null,null,null,{"$f":"(273+AA14)/(273+20)","v":1.204778156996587},null,null,null,null,18.539325842696627,18.539325842696627,22.335774820723238,null,9.0942909201336164,10.956603053949372]
[null,null,"tryck från control",{"$f":"User_Charge_Pressure","v":150},null,null,null,null,null,null,null,0.7,3.5,12.214285714285717,1.2865497076023391,1.4229747657120411,19.298245614035086,19.298245614035086,23.250104784144657,21.344621485680616,21.344621485680616,25.715533735308043,null,null,null,null,null,null,null,null,null,19.298245614035086,19.298245614035086,23.250104784144657,null,9.4593928641829272,11.396469901216975]
[null,null,"ger i bar",{"$f":"D18/D16","v":150},"bar",null,null,null,null,null,null,0.8,4,11.714285714285717,1.3414634146341462,1.5087259695905695,20.121951219512194,20.121951219512194,24.242487305419129,22.630889543858544,22.630889543858544,27.265201395843228,null,null,null,null,null,null,null,null,null,20.121951219512194,20.121951219512194,24.242487305419129,null,9.85504920838682,11.873148022390946]
[null,null,"Fjädertryck ur tabell",150,"bar",null,null,null,null,null,null,0.9,4.5,11.214285714285717,1.4012738853503184,1.6037336425678816,21.019108280254777,21.019108280254777,25.323362535597052,24.056004638518225,24.056004638518225,28.982148933095335,null,null,null,null,null,null,null,null,null,21.019108280254777,21.019108280254777,25.323362535597052,null,10.285264874941742,12.391462460254045]
[null,null,null,null,null,null,null,null,null,null,null,1,5,10.714285714285717,1.4666666666666666,1.7094798674418923,22,22,26.505119453924912,25.642198011628384,25.642198011628384,30.893160061791193,null,null,null,null,null,null,null,null,null,22,22,26.505119453924912,null,10.754777070063694,12.95712049738049]
[null,null,"Isotermt är Vi/Vf=(Ff/Fi)",null,null,null,null,"Vi/Vf = (Ff/Fi)^(1/1,4)"]
[null,null,null,null,null,null,null,null,null,null,null,null,null,null,null,null,null,null,null,null,null,null,null,null,null,null,null,null,null,null,null,null,null,{"$f":"AVERAGE(AH11:AH21)","v":21.806403438430337},"Total Work",{"$f":"SUM(AJ12:AJ21)","v":90.299629294703934},{"$f":"SUM(AK12:AK21)","v":108.79102095914843},"[Nm]"]
[null,null,"Ff/Fi = Vi/Vf = k",{"$f":"D10/D9","v":1.4666666666666666}]
[]
[null,null,"l = k*s / (k-1)",{"$f":"(D24*D11)/(D24-1)","v":15.714285714285717},"mm","Virtuell volym, Viv"]
[]
[null,null,null,{"$f":"D26-D11","v":10.714285714285717},"mm","Virtuell slutvolym, Vfv"]
[]
[null,null,"Slutvolym, utnyttjad slagl",{"$f":"D26-D14","v":10.714285714285717},"mm","Virtuell slutvolym för utnyttjad slagl, Vfvny"]
[]
[null,null,"nytt Viny / Vfny",{"$f":"D26/D30","v":1.4666666666666666}]
[]
[]
[null,null,"kappa",1.4]
[null,null,"kraft och tryckfaktor  (Viny / Vfny)^kappa",{"$f":"D32^D35","v":1.7094798674418923},"Detta ska tas multiplicerat med Fi eller Pi"]
[]
[null,null,null,{"$f":"D9*D36","v":25642.198011628385}]
[]
[]
[]
[null,null,"ger sluttryck",{"$f":"D19*D36","v":256.42198011628386}]
[]
[null,null,"Fyllutnyttande",{"$f":"D19/D20","v":1}]
[null,null,"Ger initialkraft",{"$f":"D44*D9*0.001*D17","v":15},{"$f":"E17","v":"kN"}]
[null,null,"Ger initailalkraft totalt",{"$f":"$AH$11","v":18.071672354948806},{"$f":"E17","v":"kN"}]
[null,null,"ger slutkraft per fjäder",{"$f":"D9*D32*D44*0.001*D17","v":22},"Isotermt"]
[null,null,"Ger slutkraft totalt",{"$f":"$AH$21","v":26.505119453924912}]
[null,null,"Utnyttjad slaglängd"]
[]
[null,null,"Felmeddelande om för lång slaglängd",{"$f":"IF(D12>D11,\"Used stroke length is more than 100%!\",\"\")","v":""}]
[]
[]
[]
[]
[null,null,null,null,"Utput till annan flik"]
[]
[]
[]
[]
[]
[]
[]
[]
[null,null,null,"Polytrop kurva","Förskjutning för polytropa värden"]
[null,null,1,"Isothermal ",0]
[null,null,{"$f":"INDEX(E66:E67,C66)","v":0},"Polytropic",3]

{"sheet":"Excenterpress","index":5,"n_rows":84,"n_cols":18,"rows_kept":84,"cut":false,"hidden":true,"merged":[]}
[]
[]
[null,null,null,null,null,"Impact","tid (s)","Part of stroke","Alfa",null,"stroke (mm)","Locked Spring",null,null,"return",null,"v"]
["Excenter Stroke",{"$f":"Excenter_Stroke","v":500},"mm",null,null,{"$f":"IF(M4<User_Used_Stroke_Length,1,0)","v":0},{"$f":"H4*$G$84","v":0},0,{"$f":"H4*2*PI()","v":0},{"$f":"crank_radius*COS(I4)+SQRT(rod_length^2-crank_radius^2*SIN(I4)^2)","v":650},{"$f":"J4-$B$11","v":500},{"$f":"IF(AND(G4>0.5*Period_time,G4<0.5*Period_time+Locked_Spring),Spring_Back,-10)","v":-10},{"$f":"IF(K4>=User_Used_Stroke_Length,User_Used_Stroke_Length,K4)","v":5},{"$f":"IF(G4<=0.5*Period_time,M4,-10)","v":5},{"$f":"Return_Speed*1000*G4-Return_Speed*1000*(0.5*Period_time+Locked_Spring)","v":-800},{"$f":"IF(O4>User_Used_Stroke_Length,User_Used_Stroke_Length,O4)","v":-800}]
["r crank_radius",{"$f":"Excenter_Stroke/2","v":250},null,null,null,0,7.5000000000000011E-2,1.2500000000000001E-2,{"$f":"H5*2*PI()","v":7.8539816339744828E-2},648.74811977955392,{"$f":"J5-$B$11","v":498.74811977955392},-10,5,5,-785,-785,{"$f":"SLOPE(K4:K6,G4:G6)","v":-33.295737593386995},{"$f":"Q5/1000","v":-3.3295737593386998E-2}]
["l rod_length",{"$f":"rod_length","v":400},"mm",null,null,0,0.15000000000000002,2.5000000000000001E-2,0.15707963267948966,645.00563936099195,495.00563936099195,-10,5,5,-770,-770,{"$f":"SLOPE(K5:K7,G5:G7)","v":-66.240668383128821},{"$f":"Q6/1000","v":-6.6240668383128823E-2}]
[null,null,null,null,null,0,0.22499999999999998,3.7499999999999999E-2,0.23561944901923448,638.8120195220846,488.8120195220846,-10,5,5,-755,-755,-98.484547540735235,-9.848454754073524E-2]
["Period tid",{"$f":"60/User_Strokes_per_Minute","v":6},null,null,null,0,0.30000000000000004,0.05,0.31415926535897931,630.23295722988166,480.23295722988166,-10,5,5,-740,-740,-129.6783790897469,-0.12967837908974689]
[null,null,null,null,null,0,0.375,6.25E-2,0.39269908169872414,619.36026265862256,469.36026265862256,-10,5,5,-725,-725,-159.4753728856177,-0.15947537288561769]
[null,null,null,null,null,0,0.44999999999999996,7.4999999999999997E-2,0.47123889803846897,606.31165129703902,456.31165129703902,-10,5,5,-710,-710,-187.53235751130441,-0.1875323575113044]
[null,{"$f":"MIN(J4:J44)","v":150},null,null,null,0,0.52499999999999991,8.7499999999999994E-2,0.5497787143782138,591.23040903192691,441.23040903192691,-10,5,5,-695,-695,-213.51189493306472,-0.21351189493306472]
[null,null,null,null,null,0,0.60000000000000009,0.1,0.62831853071795862,574.28486705707928,424.28486705707928,-10,5,5,-680,-680,-237.0854183883267,-0.2370854183883267]
["slaglängd",{"$f":"User_Used_Stroke_Length","v":5},null,null,null,0,0.67500000000000004,0.1125,0.70685834705770345,555.66759627367787,405.66759627367787,-10,5,5,-665,-665,-257.93779600172928,-0.25793779600172928]
["Returnspeed",{"$f":"Return_Speed","v":0.2},null,null,null,0,0.75,0.125,0.78539816339744828,535.59419765681992,385.59419765681992,-10,5,5,-650,-650,-275.77378751297977,-0.27577378751297976]
["Returtid",{"$f":"Returtid","v":2.5000000000000001E-2},null,null,null,0,0.82500000000000007,0.13750000000000001,0.86393797973719322,514.3015281467309,364.3015281467309,-10,5,5,-635,-635,-290.32687158506383,-0.29032687158506382]
[null,null,null,null,null,0,0.89999999999999991,0.15,0.94247779607693793,492.04516691906036,342.04516691906036,-10,5,5,-620,-620,-301.37081654114274,-0.30137081654114273]
[null,null,null,null,null,0,0.97500000000000009,0.16250000000000001,1.0210176124166828,469.09590566555948,319.09590566555948,-10,5,5,-605,-605,-308.73407013384798,-0.30873407013384796]
["Press velocity at impact",{"$f":"ABS(ROUND(VLOOKUP(1,F5:R84,13,FALSE),2))","v":0.03},null,null,null,0,1.0499999999999998,0.17499999999999999,1.0995574287564276,445.7350563989832,295.7350563989832,-10,5,5,-590,-590,-312.31647775508935,-0.31231647775508936]
[null,null,null,null,null,0,1.125,0.1875,1.1780972450961724,422.24843400229611,272.24843400229611,-10,5,5,-575,-575,-312.10697397005111,-0.3121069739700511]
["Max Press speed",{"$f":"ROUND(MAX(R5:R84),2)","v":0.31},null,null,null,0,1.2000000000000002,0.2,1.2566370614359172,398.91901030347543,248.91901030347543,-10,5,5,-560,-560,-308.19981781657646,-0.30819981781657646]
[null,null,null,null,null,0,1.2749999999999999,0.21249999999999999,1.3351768777756621,376.01846132980967,226.01846132980967,-10,5,5,-545,-545,-300.80593427940636,-0.30080593427940638]
[null,null,null,null,null,0,1.35,0.22500000000000001,1.4137166941154069,353.7981201615645,203.7981201615645,-10,5,5,-530,-530,-290.2554534617189,-0.29025545346171888]
[null,null,null,null,null,0,1.4249999999999998,0.23749999999999999,1.4922565104551517,332.48014331055185,182.48014331055185,-10,5,5,-515,-515,-276.98813494429731,-0.2769881349442973]
[null,null,null,null,null,0,1.5,0.25,1.5707963267948966,312.24989991991993,162.24989991991993,-10,5,5,-500,-500,-261.53031909281572,-0.26153031909281571]
[null,null,null,null,null,0,1.5750000000000002,0.26250000000000001,1.6493361431346414,293.2505954466294,143.2505954466294,-10,5,5,-484.99999999999994,-484.99999999999994,-244.46008185647256,-0.24446008185647256]
[null,null,null,null,null,0,1.6500000000000001,0.27500000000000002,1.7278759594743864,275.58088764144901,125.58088764144901,-10,5,5,-470,-470,-226.36544029848295,-0.22636544029848296]
[null,null,null,null,null,0,1.7249999999999999,0.28749999999999998,1.8064157758141308,259.29577940185703,109.29577940185703,-10,5,5,-455,-455,-207.80249683631553,-0.20780249683631552]
[null,null,null,null,null,0,1.7999999999999998,0.3,1.8849555921538759,244.41051311600174,94.410513116001738,-10,5,5,-440.00000000000006,-440.00000000000006,-189.260410547372,-0.189260410547372]
[null,null,null,null,null,0,1.875,0.3125,1.9634954084936207,230.90671781975121,80.906717819751208,-10,5,5,-425,-425,-171.13804391194603,-0.17113804391194604]
[null,null,null,null,null,0,1.9500000000000002,0.32500000000000001,2.0420352248333655,218.73980652920977,68.739806529209773,-10,5,5,-409.99999999999994,-409.99999999999994,-153.73396341444069,-0.15373396341444071]
[null,null,null,null,null,0,2.0250000000000004,0.33750000000000002,2.1205750411731104,207.84662330758505,57.846623307585048,-10,5,5,-394.99999999999994,-394.99999999999994,-137.24843837590691,-0.13724843837590692]
[null,null,null,null,null,0,2.0999999999999996,0.35,2.1991148575128552,198.15254077282381,48.152540772823812,-10,5,5,-380.00000000000006,-380.00000000000006,-121.79412883963953,-0.12179412883963953]
[null,null,null,null,null,0,2.1749999999999998,0.36249999999999999,2.2776546738526,189.57750398163918,39.577503981639182,-10,5,5,-365.00000000000006,-365.00000000000006,-107.4115580618503,-0.10741155806185031]
[null,null,null,null,null,0,2.25,0.375,2.3561944901923448,182.04080706354623,32.040807063546225,-10,5,5,-350,-350,-94.085936719844923,-9.4085936719844929E-2]
[null,null,null,null,null,0,2.3250000000000002,0.38750000000000001,2.4347343065320897,175.46461347366241,25.464613473662411,-10,5,5,-334.99999999999994,-334.99999999999994,-81.762914626270344,-8.1762914626270347E-2]
[null,null,null,null,null,{"$f":"IF(M36<User_Used_Stroke_Length,1,0)","v":0},2.4000000000000004,0.4,2.5132741228718345,{"$f":"crank_radius*COS(I36)+SQRT(rod_length^2-crank_radius^2*SIN(I36)^2)","v":169.77636986960565},19.776369869605645,{"$f":"IF(AND(G36>0.5*Period_time,G36<0.5*Period_time+Locked_Spring),Spring_Back,-10)","v":-10},{"$f":"IF(K36>=User_Used_Stroke_Length,User_Used_Stroke_Length,K36)","v":5},{"$f":"IF(G36<=0.5*Period_time,M36,-10)","v":5},{"$f":"Return_Speed*1000*G36-Return_Speed*1000*(0.5*Period_time+Locked_Spring)","v":-319.99999999999994},{"$f":"IF(O36>User_Used_Stroke_Length,User_Used_Stroke_Length,O36)","v":-319.99999999999994},-70.361910791876952,-7.0361910791876953E-2]
[null,null,null,null,null,0,2.4749999999999996,0.41249999999999998,2.5918139392115793,164.91032685488091,14.910326854880907,-10,5,5,-305.00000000000006,-305.00000000000006,-59.786537778337006,-5.9786537778337007E-2]
[null,null,null,null,null,0,2.5499999999999998,0.42499999999999999,2.6703537555513241,160.80838920285512,10.808389202855125,-10,5,5,-290.00000000000006,-290.00000000000006,-49.932203012677469,-4.9932203012677472E-2]
[null,null,null,null,null,0,2.625,0.4375,2.748893571891069,157.42049640297927,7.4204964029792677,-10,5,5,-275,-275,-40.691267470334552,-4.0691267470334552E-2]
[null,null,null,null,null,1,2.7,0.45,2.8274333882308138,154.70469908230493,4.7046990823049271,-10,4.7046990823049271,4.7046990823049271,-260,-260,-31.95624719821933,-3.195624719821933E-2]
[null,null,null,null,null,1,2.7750000000000004,0.46250000000000002,2.9059732045705586,152.62705932324636,2.6270593232463568,-10,2.6270593232463568,2.6270593232463568,-244.99999999999989,-244.99999999999989,-23.62153345921238,-2.362153345921238E-2]
[null,null,null,null,null,1,2.8499999999999996,0.47499999999999998,2.9845130209103035,151.16146906342308,1.161469063423084,-10,1.161469063423084,1.161469063423084,-230.00000000000011,-230.00000000000011,-15.584042735043084,-1.5584042735043085E-2]
[null,null,null,null,null,1,2.9249999999999998,0.48749999999999999,3.0630528372500483,150.2894529129899,0.28945291298990128,-10,0.28945291298990128,0.28945291298990128,-215,-215,-7.7431270894872073,-7.7431270894872074E-3]
[null,null,null,null,null,1,{"$f":"H44*$G$84","v":3},0.5,3.1415926535897931,150,0,-10,0,0,-200,-200,-1.9328674463439382E-13,-1.9328674463439381E-16]
[null,null,null,null,null,1,3.0749999999999997,0.51249999999999996,3.2201324699295375,150.28945291298987,0.28945291298987286,{"$error":"#REF!"},0.28945291298987286,-10,-185,-185,7.743127089487027,7.743127089487027E-3]
[null,null,null,null,null,1,3.1500000000000004,0.52500000000000002,3.2986722862692828,151.16146906342306,1.1614690634230556,{"$error":"#REF!"},1.1614690634230556,-10,-169.99999999999989,-169.99999999999989,15.584042735043036,1.5584042735043036E-2]
[null,null,null,null,null,1,3.2249999999999996,0.53749999999999998,3.3772121026090276,152.62705932324633,2.6270593232463284,{"$error":"#REF!"},2.6270593232463284,-10,-155.00000000000011,-155.00000000000011,23.621533459212504,2.3621533459212505E-2]
[null,null,null,null,null,1,3.3000000000000003,0.55000000000000004,3.4557519189487729,154.70469908230493,4.7046990823049271,{"$error":"#REF!"},4.7046990823049271,-10,-140,-140,31.9562471982197,3.1956247198219698E-2]
[null,null,null,null,null,0,3.375,0.5625,3.5342917352885173,157.4204964029793,7.4204964029792961,{"$error":"#REF!"},5,-10,-125,-125,40.691267470334232,4.0691267470334233E-2]
[null,null,null,null,null,0,3.4499999999999997,0.57499999999999996,3.6128315516282616,160.80838920285504,10.808389202855039,{"$error":"#REF!"},5,-10,-110,-110,49.932203012677107,4.9932203012677104E-2]
[null,null,null,null,null,0,3.5250000000000004,0.58750000000000002,3.6913713679680069,164.91032685488088,14.910326854880878,{"$error":"#REF!"},5,-10,-94.999999999999886,-94.999999999999886,59.786537778337014,5.9786537778337014E-2]
[null,null,null,null,null,0,3.5999999999999996,0.6,3.7699111843077517,169.77636986960559,19.776369869605588,{"$error":"#REF!"},5,-10,-80.000000000000114,-80.000000000000114,70.361910791877321,7.0361910791877327E-2]
[null,null,null,null,null,0,3.6750000000000003,0.61250000000000004,3.848451000647497,175.46461347366247,25.464613473662467,{"$error":"#REF!"},5,-10,-65,-65,81.76291462627033,8.1762914626270333E-2]
[null,null,null,null,null,0,3.75,0.625,3.9269908169872414,182.04080706354617,32.040807063546168,{"$error":"#REF!"},5,-10,-50,-50,94.08593671984454,9.408593671984454E-2]
[null,null,null,null,null,0,3.8249999999999997,0.63749999999999996,4.0055306333269858,189.5775039816391,39.577503981639097,{"$error":"#REF!"},5,-10,-35,-35,107.41155806185034,0.10741155806185035]
[null,null,null,null,null,0,3.9000000000000004,0.65,4.0840704496667311,198.15254077282376,48.152540772823755,{"$error":"#REF!"},5,-10,-19.999999999999886,-19.999999999999886,121.79412883963917,0.12179412883963917]
[null,null,null,null,null,0,3.9749999999999996,0.66249999999999998,4.1626102660064754,207.84662330758496,57.846623307584963,{"$error":"#REF!"},5,-10,-5.0000000000001137,-5.0000000000001137,137.24843837590649,0.1372484383759065]
[null,null,null,null,null,0,4.0500000000000007,0.67500000000000004,4.2411500823462207,218.73980652920977,68.739806529209773,-10,5,-10,10.000000000000114,5,153.7339634144403,0.15373396341444029]
[null,null,null,null,null,0,4.125,0.6875,4.3196898986859651,230.90671781975107,80.906717819751066,-10,5,-10,25,5,171.13804391194768,0.17113804391194767]
[null,null,null,null,null,0,4.1999999999999993,0.7,4.3982297150257104,244.41051311600168,94.410513116001681,-10,5,-10,39.999999999999886,5,189.26041054737271,0.18926041054737272]
[null,null,null,null,null,0,4.2750000000000004,0.71250000000000002,4.4767695313654556,259.29577940185703,109.29577940185703,-10,5,-10,55.000000000000114,5,207.80249683631502,0.20780249683631502]
[null,null,null,null,null,0,4.3499999999999996,0.72499999999999998,4.5553093477052,275.58088764144901,125.58088764144901,-10,5,-10,69.999999999999886,5,226.36544029848238,0.22636544029848238]
[null,null,null,null,null,0,4.4250000000000007,0.73750000000000004,4.6338491640449453,293.25059544662946,143.25059544662946,-10,5,-10,85.000000000000114,5,244.46008185647176,0.24446008185647175]
[null,null,null,null,null,0,4.5,0.75,4.7123889803846897,312.24989991991987,162.24989991991987,-10,5,-10,100,5,261.53031909281691,0.26153031909281693]
[null,null,null,null,null,0,4.5749999999999993,0.76249999999999996,4.7909287967244341,332.48014331055163,182.48014331055163,-10,5,-10,114.99999999999989,5,276.98813494429652,0.27698813494429653]
[null,null,null,null,null,0,4.6500000000000004,0.77500000000000002,4.8694686130641793,353.79812016156444,203.79812016156444,-10,5,-10,130.00000000000011,5,290.25545346171805,0.29025545346171805]
[null,null,null,null,null,0,4.7249999999999996,0.78749999999999998,4.9480084294039237,376.01846132980944,226.01846132980944,-10,5,-10,144.99999999999989,5,300.80593427940556,0.30080593427940555]
[null,null,null,null,null,{"$f":"IF(M68<User_Used_Stroke_Length,1,0)","v":0},4.8000000000000007,0.8,5.026548245743669,{"$f":"crank_radius*COS(I68)+SQRT(rod_length^2-crank_radius^2*SIN(I68)^2)","v":398.91901030347537},248.91901030347537,{"$f":"IF(AND(G68>0.5*Period_time,G68<0.5*Period_time+Locked_Spring),Spring_Back,-10)","v":-10},{"$f":"IF(K68>=User_Used_Stroke_Length,User_Used_Stroke_Length,K68)","v":5},{"$f":"IF(G68<=0.5*Period_time,M68,-10)","v":-10},{"$f":"Return_Speed*1000*G68-Return_Speed*1000*(0.5*Period_time+Locked_Spring)","v":160.00000000000011},{"$f":"IF(O68>User_Used_Stroke_Length,User_Used_Stroke_Length,O68)","v":5},308.19981781657742,0.3081998178165774]
[null,null,null,null,null,0,4.875,0.8125,{"$f":"H69*2*PI()","v":5.1050880620834143},422.24843400229616,{"$f":"J69-$B$11","v":272.24843400229616},-10,5,-10,175,5,312.10697397005481,0.31210697397005482]
[null,null,null,null,null,0,4.9499999999999993,0.82499999999999996,5.1836278784231586,445.73505639898315,295.73505639898315,-10,5,-10,189.99999999999989,5,{"$f":"SLOPE(K69:K71,G69:G71)","v":312.31647775508844},{"$f":"Q70/1000","v":0.31231647775508842}]
[null,null,null,null,null,0,5.0250000000000004,0.83750000000000002,5.2621676947629039,469.09590566555954,319.09590566555954,-10,5,-10,205.00000000000011,5,308.73407013384707,0.30873407013384707]
[null,null,null,null,null,0,5.0999999999999996,0.85,5.3407075111026483,492.04516691906031,342.04516691906031,-10,5,-10,219.99999999999989,5,301.3708165411424,0.30137081654114239]
[null,null,null,null,null,0,5.1750000000000007,0.86250000000000004,5.4192473274423936,514.30152814673102,364.30152814673102,-10,5,-10,235.00000000000023,5,290.32687158506337,0.29032687158506337]
[null,null,null,null,null,0,5.25,0.875,5.497787143782138,535.59419765681992,385.59419765681992,-10,5,-10,250,5,275.7737875129809,0.27577378751298093]
[null,null,null,null,null,0,5.3249999999999993,0.88749999999999996,5.5763269601218823,555.66759627367776,405.66759627367776,-10,5,-10,264.99999999999977,5,257.93779600172843,0.25793779600172845]
[null,null,null,null,null,0,5.4,0.9,5.6548667764616276,574.28486705707928,424.28486705707928,-10,5,-10,280,5,237.08541838832716,0.23708541838832717]
[null,null,null,null,null,0,5.4749999999999996,0.91249999999999998,5.733406592801372,591.23040903192691,441.23040903192691,-10,5,-10,295,5,213.51189493306438,0.21351189493306438]
[null,null,null,null,null,0,5.5500000000000007,0.92500000000000004,5.8119464091411173,606.31165129703902,456.31165129703902,-10,5,-10,310.00000000000023,5,187.53235751130396,0.18753235751130395]
[null,null,null,null,null,0,5.625,0.9375,5.8904862254808616,619.36026265862256,469.36026265862256,-10,5,-10,325,5,159.47537288561915,0.15947537288561914]
[null,null,null,null,null,0,5.6999999999999993,0.95,5.9690260418206069,630.23295722988166,480.23295722988166,-10,5,-10,339.99999999999977,5,129.6783790897473,0.1296783790897473]
[null,null,null,null,null,0,5.7750000000000004,0.96250000000000002,6.0475658581603522,638.81201952208471,488.81201952208471,-10,5,-10,355,5,98.484547540733047,9.8484547540733047E-2]
[null,null,null,null,null,0,5.8500000000000059,0.97500000000000098,6.1261056745001028,645.00563936099229,495.00563936099229,-10,5,-10,370.00000000000114,5,66.240668383128266,6.6240668383128268E-2]
[null,null,null,null,null,0,5.9250000000000007,0.98750000000000004,6.2046454908398418,648.74811977955392,498.74811977955392,-10,5,-10,385.00000000000023,5,33.295737593385859,3.329573759338586E-2]
[null,null,null,null,null,0,{"$f":"B8","v":6},1,6.2831853071795862,650,500,-10,5,-10,400,5,16.691736272614595,1.6691736272614596E-2]

{"sheet":"Spring_Back","index":6,"n_rows":73,"n_cols":24,"rows_kept":73,"cut":false,"hidden":true,"merged":[]}
[null,null,null,null,null,null,null,null,null,null,null,null,null,null,null,null,null,null,null,"vv 100% Olja",{"$f":"H13/G20","v":3.052844176954514}]
[null,null,{"$f":"User_Used_Stroke_Length","v":5},"mm",null,null,null,null,null,null,null,null,null,null,null,null,null,null,null,"vv 75% Olja",{"$f":"(0.75*H13)/G20","v":2.2896331327158856}]
[null,null,{"$f":"Stroke_margin","v":{"$error":"#NAME?"}},"mm",null,null,null,null,null,null,null,null,null,null,null,null,null,null,null,"vv 50% Olja",{"$f":"(0.5*H13)/G20","v":1.526422088477257}]
[null,"Använt slag",{"$f":"C2-C3","v":{"$error":"#NAME?"}},"mm",null,null,null,null,null,null,null,null,null,null,null,null,null,null,null,"vv 25% Olja",{"$f":"(0.25*H13)/G20","v":0.76321104423862851}]
[]
[]
[null,"Dt","Dks","Dksi","Vov","Vne-Voil","Vne","Voil"]
[1500,80,36,12,{"$f":"KF1500VOL_ov(User_Used_Stroke_Length)","v":26412},{"$f":"KF1500VOL_ne(User_Used_Stroke_Length)-H8","v":21282},{"$f":"KF1500VOL_ne(User_Used_Stroke_Length)","v":36282},{"$f":"KF1500_Oil(User_Used_Stroke_Length)","v":15000},null,null,null,null,null,null,null,null,null,"Del av slag","Använt slag","vv nedre volym utan olja","vv övre volym","Volymkvot","Formel"]
[3000,100,50,12,{"$f":"KF3000VOL_ov(User_Used_Stroke_Length)","v":29248},{"$f":"KF3000VOL_ne(User_Used_Stroke_Length)-H9","v":42571},{"$f":"KF3000VOL_ne(User_Used_Stroke_Length)","v":57571},{"$f":"KF3000_Oil(User_Used_Stroke_Length)","v":15000},null,null,null,null,null,null,null,null,null,0.7,{"$f":"User_Used_Stroke_Length*R9","v":3.5},{"$f":"($G$13-S9*$G$20)/$G$20","v":3.8842194952175788},{"$f":"($E$13+S9*$G$19)/$G$19","v":10.280000575714741},{"$f":"T9/U9","v":0.37784234218756541},{"$f":"(T9*U9*($G$21^(1/1.4)-1))/(U9+T9*$G$21^(1/1.4))","v":0.48445727376923831}]
[5000,125,65,15,{"$f":"KF5000VOL_ov(User_Used_Stroke_Length)","v":101815},{"$f":"KF5000VOL_ne(User_Used_Stroke_Length)-H10","v":72534},{"$f":"KF5000VOL_ne(User_Used_Stroke_Length)","v":102534},{"$f":"KF5000_Oil(User_Used_Stroke_Length)","v":30000},null,null,null,null,null,null,null,null,null,0.71,3.55,{"$f":"($G$13-S10*$G$20)/$G$20","v":3.8342194952175785},{"$f":"($E$13+S10*$G$19)/$G$19","v":10.330000575714742},{"$f":"T10/U10","v":0.37117321215176075},0.4808387216368708]
[7500,160,80,15,{"$f":"KF7500VOL_ov(User_Used_Stroke_Length)","v":424997},{"$f":"KF7500VOL_ne(User_Used_Stroke_Length)-H11","v":100311},{"$f":"KF7500VOL_ne(User_Used_Stroke_Length)","v":150311},{"$f":"KF7500_Oil(User_Used_Stroke_Length)","v":50000},null,null,null,null,null,null,null,null,null,0.72,3.5999999999999996,3.7842194952175792,10.380000575714741,0.36456833192005939,0.47715503653203767]
[null,null,null,null,null,null,null,null,null,null,null,null,null,null,null,null,null,0.73,3.65,3.7342194952175789,10.430000575714741,0.35802677747807143,0.47340609970249281]
[{"$f":"Force_Size","v":1500},{"$f":"VLOOKUP($A$13,$A$8:$I$11,2)","v":80},{"$f":"VLOOKUP($A$13,$A$8:$I$11,3)","v":36},{"$f":"VLOOKUP($A$13,$A$8:$I$11,4)","v":12},{"$f":"VLOOKUP($A$13,$A$8:$I$11,5)","v":26412},{"$f":"VLOOKUP($A$13,$A$8:$I$11,6)","v":21282},{"$f":"VLOOKUP($A$13,$A$8:$I$11,7)","v":36282},{"$f":"VLOOKUP($A$13,$A$8:$I$11,8)","v":15000},null,null,null,null,null,null,null,null,null,0.74,3.7,3.6842194952175791,10.480000575714742,0.35154764244526898,0.46959179210713142]
[null,null,null,null,null,null,null,null,null,null,null,null,null,null,null,null,null,0.75,3.75,3.6342194952175788,10.530000575714741,0.34513003765632749,0.46571199441511096]
[null,null,null,null,null,null,null,null,null,null,null,null,null,null,null,null,null,0.76,3.8,3.5842194952175785,10.580000575714742,0.33877309075433992,0.46176658700496981]
[null,null,null,null,null,null,null,null,null,null,null,null,null,null,null,null,null,0.77,3.85,3.5342194952175783,10.630000575714742,0.33247594579551032,0.45775544996374062]
[null,null,null,null,null,null,null,null,null,null,null,null,null,null,null,null,null,0.78,3.9000000000000004,3.4842194952175785,10.680000575714743,0.3262377628649521,0.45367846308606358]
[null,null,null,null,null,null,null,null,null,null,null,null,null,null,null,null,null,0.79,3.95,3.4342194952175791,10.730000575714742,0.32005771770322766,0.449535505873293]
[null,null,null,null,null,"Aov",{"$f":"0.25*PI()*(Dt^2-Dks^2-Dksi^2)","v":3895.5748904513434},null,null,null,null,null,null,null,null,null,null,0.8,4,3.3842194952175788,10.780000575714743,0.31393500134328112,0.44532645753260347]
[null,null,null,null,null,"Ane",{"$f":"0.25*PI()*(Dt^2-Dksi^2)","v":4913.4509102144366},null,null,null,null,null,null,null,null,null,null,0.81,4.0500000000000007,3.3342194952175781,10.830000575714744,0.3078688197574293,0.44105119697609102]
[null,null,null,null,null,"Ratio",{"$f":"G20/G19","v":1.2612903225806451},null,null,null,null,null,null,null,null,null,null,0.82,4.0999999999999996,3.2842194952175792,10.880000575714741,0.30185839351408572,0.43670960281987187]
[null,null,null,null,null,null,null,null,null,null,null,null,null,null,null,null,null,0.83,4.1499999999999995,3.2342194952175789,10.930000575714741,0.29590295744390527,0.43230155338317677]
[null,null,null,null,null,null,null,null,null,null,null,null,null,null,null,null,null,0.84,4.2,3.1842194952175791,10.980000575714742,0.29000176031505376,0.42782692668744399]
[null,null,null,null,null,null,null,null,null,null,null,null,null,null,null,null,null,0.85,4.25,3.1342194952175788,11.030000575714741,0.2841540645173069,0.42328560045540659]
[null,null,null,null,null,null,null,null,null,null,null,null,null,null,null,null,null,0.86,4.3,3.0842194952175785,11.080000575714742,0.2783591457547035,0.41867745211017821]
[null,null,null,null,null,null,null,null,null,null,null,null,null,null,null,null,null,0.87,4.3499999999999996,3.0342194952175792,11.130000575714741,0.27261629274648347,0.41400235877433489]
[null,null,null,null,null,null,null,null,null,null,null,null,null,null,null,null,null,0.88,4.4000000000000004,2.9842194952175785,11.180000575714741,0.26692480693604942,0.40926019726899249]
[null,null,null,null,null,null,null,null,null,null,null,null,null,null,null,null,null,0.89,4.45,2.9342194952175791,11.230000575714742,0.26128400220770498,0.40445084411288301]
[null,null,null,null,null,null,null,null,null,null,null,null,null,null,null,null,null,0.9,4.5,2.8842194952175788,11.280000575714743,0.25569320461092476,0.39957417552142493]
[null,null,null,null,null,null,null,null,null,null,null,null,null,null,null,null,null,0.91,4.55,2.8342194952175785,11.330000575714742,0.25015175209192647,0.39463006740579193]
[null,null,null,null,null,null,null,null,null,null,null,null,null,null,null,null,null,0.92,4.6000000000000005,2.7842194952175783,11.380000575714742,0.24465899423231885,0.38961839537197757]
[null,null,null,null,null,null,null,null,null,null,null,null,null,null,null,null,null,0.93,4.6500000000000004,2.7342194952175785,11.430000575714743,0.23921429199460925,0.38453903471985657]
[null,null,null,null,null,null,null,null,null,null,null,null,null,null,null,null,null,0.94,4.6999999999999993,2.6842194952175795,11.48000057571474,0.23381701747436201,0.37939186044224221]
[null,null,null,null,null,null,null,null,null,null,null,null,null,null,null,null,null,0.95,4.75,2.6342194952175788,11.530000575714741,0.2284665536588045,0.37417674722394068]
[null,null,null,null,null,null,null,null,null,null,null,null,null,null,null,null,null,0.96,4.8,2.5842194952175785,11.580000575714742,0.22316229419168876,0.36889356944080254]
[null,null,null,null,null,null,null,null,null,null,null,null,null,null,null,null,null,0.97,4.8499999999999996,2.5342194952175792,11.630000575714741,0.21790364314421667,0.36354220115876906]
[null,null,null,null,null,null,null,null,null,null,null,null,null,null,null,null,null,0.98,4.9000000000000004,2.4842194952175785,11.680000575714743,0.21269001479184943,0.35812251613291662]
[null,null,null,null,null,null,null,null,null,null,null,null,null,null,null,null,null,0.99,4.95,2.4342194952175791,11.730000575714742,0.20752083339682659,0.35263438780649653]
[null,null,null,null,null,null,null,null,null,null,null,null,null,null,null,null,null,1,5,2.3842194952175788,11.780000575714741,0.20239553299622132,0.3470776893099719]
[]
[]
[null,null,null,null,null,null,null,null,null,null,null,null,null,null,null,null,null,"Del av slag","Använt slag","vv nedre volym","vv övre volym","Volymkvot","Formel"]
[null,null,null,null,null,null,null,null,null,null,null,null,null,null,null,null,null,0.7,{"$f":"User_Used_Stroke_Length*R43","v":3.5},{"$f":"(($G$13-S43*$G$20)/$G$20)-$U$1","v":0.83137531826306477},{"$f":"($E$13+S43*$G$19)/$G$19","v":10.280000575714741},{"$f":"T43/U43","v":8.0873080904984435E-2},{"$f":"(T43*U43*($G$21^(1/1.4)-1))/(U43+T43*$G$21^(1/1.4))","v":0.13687276461895001},{"$f":"IF(W43<0,0,W43)","v":0.13687276461895001}]
[null,null,null,null,null,null,null,null,null,null,null,null,null,null,null,null,null,0.71,3.55,{"$f":"(($G$13-S44*$G$20)/$G$20)-$U$1","v":0.7813753182630645},{"$f":"($E$13+S44*$G$19)/$G$19","v":10.330000575714742},{"$f":"T44/U44","v":7.5641362508733503E-2},0.12937033667190584,{"$f":"IF(W44<0,0,W44)","v":0.12937033667190584}]
[null,null,null,null,null,null,null,null,null,null,null,null,null,null,null,null,null,0.72,3.5999999999999996,0.73137531826306512,10.380000575714741,7.0460046021019074E-2,0.12177567090366603,0.12177567090366603]
[null,null,null,null,null,null,null,null,null,null,null,null,null,null,null,null,null,0.73,3.65,0.68137531826306486,10.430000575714741,6.5328406582218418E-2,0.11408854520244305,0.11408854520244305]
[null,null,null,null,null,null,null,null,null,null,null,null,null,null,null,null,null,0.74,3.7,0.63137531826306503,10.480000575714742,6.0245733165907284E-2,0.10630873674274009,0.10630873674274009]
[null,null,null,null,null,null,null,null,null,null,null,null,null,null,null,null,null,0.75,3.75,0.58137531826306477,10.530000575714741,5.5211328250435822E-2,9.8436021982481178E-2,9.8436021982481178E-2]
[null,null,null,null,null,null,null,null,null,null,null,null,null,null,null,null,null,0.76,3.8,0.5313753182630645,10.580000575714742,5.0224507499818064E-2,9.0470176660128951E-2,9.0470176660128951E-2]
[null,null,null,null,null,null,null,null,null,null,null,null,null,null,null,null,null,0.77,3.85,0.48137531826306423,10.630000575714742,4.5284599453626784E-2,8.241097579178748E-2,8.241097579178748E-2]
[null,null,null,null,null,null,null,null,null,null,null,null,null,null,null,null,null,0.78,3.9000000000000004,0.43137531826306441,10.680000575714743,4.0390945225599419E-2,7.4258193668291742E-2,7.4258193668291742E-2]
[null,null,null,null,null,null,null,null,null,null,null,null,null,null,null,null,null,0.79,3.95,0.38137531826306503,10.730000575714742,3.5542898210670505E-2,6.6011603852282608E-2,6.6011603852282608E-2]
[null,null,null,null,null,null,null,null,null,null,null,null,null,null,null,null,null,0.8,4,0.33137531826306477,10.780000575714743,3.0739823800157239E-2,5.7670979175267562E-2,5.7670979175267562E-2]
[null,null,null,null,null,null,null,null,null,null,null,null,null,null,null,null,null,0.81,4.0500000000000007,0.28137531826306406,10.830000575714744,2.5981099104834926E-2,4.9236091734667913E-2,4.9236091734667913E-2]
[null,null,null,null,null,null,null,null,null,null,null,null,null,null,null,null,null,0.82,4.0999999999999996,0.23137531826306512,10.880000575714741,2.1266112685648032E-2,4.0706712890851336E-2,4.0706712890851336E-2]
[null,null,null,null,null,null,null,null,null,null,null,null,null,null,null,null,null,0.83,4.1499999999999995,0.18137531826306486,10.930000575714741,1.6594264291811735E-2,3.2082613264148512E-2,3.2082613264148512E-2]
[null,null,null,null,null,null,null,null,null,null,null,null,null,null,null,null,null,0.84,4.2,0.13137531826306503,10.980000575714742,1.1964964606070903E-2,2.3363562731858408E-2,2.3363562731858408E-2]
[null,null,null,null,null,null,null,null,null,null,null,null,null,null,null,null,null,0.85,4.25,8.1375318263064766E-2,11.030000575714741,7.3776349968859064E-3,1.4549330425235901E-2,1.4549330425235901E-2]
[null,null,null,null,null,null,null,null,null,null,null,null,null,null,null,null,null,0.86,4.3,3.13753182630645E-2,11.080000575714742,2.8317072773293211E-3,5.6396847264667182E-3,5.6396847264667182E-3]
[null,null,null,null,null,null,null,null,null,null,null,null,null,null,null,null,null,0.87,4.3499999999999996,-1.8624681736934878E-2,11.130000575714741,-1.6733765295190784E-3,-3.3656067343731748E-3,0]
[null,null,null,null,null,null,null,null,null,null,null,null,null,null,null,null,null,0.88,4.4000000000000004,-6.8624681736935589E-2,11.180000575714741,-6.1381644188822759E-3,-1.2466777082373518E-2,0]
[null,null,null,null,null,null,null,null,null,null,null,null,null,null,null,null,null,0.89,4.45,-0.11862468173693497,11.230000575714742,-1.0563194626495824E-2,-2.166406020085852E-2,0]
[null,null,null,null,null,null,null,null,null,null,null,null,null,null,null,null,null,0.9,4.5,-0.16862468173693523,11.280000575714743,-1.4948995844909392E-2,-3.0957690734473815E-2,0]
[null,null,null,null,null,null,null,null,null,null,null,null,null,null,null,null,null,0.91,4.55,-0.2186246817369355,11.330000575714742,-1.9296087434059445E-2,-4.0347904092285274E-2,0]
[null,null,null,null,null,null,null,null,null,null,null,null,null,null,null,null,null,0.92,4.6000000000000005,-0.26862468173693577,11.380000575714742,-2.3604979626291829E-2,-4.9834936450895179E-2,0]
[null,null,null,null,null,null,null,null,null,null,null,null,null,null,null,null,null,0.93,4.6500000000000004,-0.31862468173693559,11.430000575714743,-2.7876173726002748E-2,-5.9419024757572644E-2,0]
[null,null,null,null,null,null,null,null,null,null,null,null,null,null,null,null,null,0.94,4.6999999999999993,-0.36862468173693452,11.48000057571474,-3.2110162304062786E-2,-6.9100406733399719E-2,0]
[null,null,null,null,null,null,null,null,null,null,null,null,null,null,null,null,null,0.95,4.75,-0.41862468173693523,11.530000575714741,-3.6307429387182386E-2,-7.8879320876433442E-2,0]
[null,null,null,null,null,null,null,null,null,null,null,null,null,null,null,null,null,0.96,4.8,-0.4686246817369355,11.580000575714742,-4.0468450642370632E-2,-8.8756006464881229E-2,0]
[null,null,null,null,null,null,null,null,null,null,null,null,null,null,null,null,null,0.97,4.8499999999999996,-0.51862468173693488,11.630000575714741,-4.459369355663699E-2,-9.8730703560294689E-2,0]
[null,null,null,null,null,null,null,null,null,null,null,null,null,null,null,null,null,0.98,4.9000000000000004,-0.56862468173693559,11.680000575714743,-4.8683617612076985E-2,-0.10880365301077818,0]
[null,null,null,null,null,null,null,null,null,null,null,null,null,null,null,null,null,0.99,4.95,-0.61862468173693497,11.730000575714742,-5.2738674456479333E-2,-0.11897509645421116,0]
[null,null,null,null,null,null,null,null,null,null,null,null,null,null,null,null,null,1,5,-0.66862468173693523,11.780000575714741,-5.6759308069589551E-2,-0.1292452763214901,0]

{"sheet":"För_Helpdesk","index":7,"n_rows":36,"n_cols":20,"rows_kept":36,"cut":false,"hidden":true,"merged":[]}
[]
[]
[]
[]
[]
[]
[]
[]
[null,"Adjusting Stroke Length"]
[]
[null,"Stroke adjustment",null,{"$f":"User_Used_Stroke_Length-Stroke","v":-5},"mm",null,"Configuration"]
[null,null,null,null,null,{"$f":"Spacer_List","v":"Spacer (1 mm)"},0]
[null,null,null,null,null,"Spacer (2 mm)",0]
[null,null,null,null,null,"Spacer (4 mm)",1]
[null,null,null,null,null,"Spacer (8 mm)",1]
[]
[]
[]
[]
[]
[]
[]
[]
[]
[]
[]
[]
[]
[null,null,null,null,null,null,null,null,null,null,null,null,null,null,null,null,"Press Stroke",null,500,"mm"]
[null,null,null,null,null,null,null,null,null,null,null,null,null,null,null,null,"Rod Length",null,400,"mm"]
[]
[null,null,null,null,null,null,null,null,null,null,null,null,null,null,null,null,"Gas Spring Impact Press Speed",null,{"$f":"Press_velocity_at_impact","v":0.03},"m/s"]
[null,null,null,null,null,null,null,null,null,null,null,null,null,null,null,null,"Max Press Speed",null,{"$f":"Max_Press_Speed","v":0.31},"m/s"]
[]
[null,null,null,null,null,null,null,null,null,null,null,null,null,null,null,null,"KF Spring"]
[null,null,null,null,null,null,null,null,null,null,null,null,null,null,null,null,"KF Spring locking time",null,2,"s"]

{"sheet":"Blad1","index":8,"n_rows":0,"n_cols":0,"rows_kept":0,"cut":false,"hidden":true,"merged":[]}