{"text_format":"1","workbook":"xlsx","n_sheets":11,"sheets":["Calculator","Hyson","Ford","GM","FCA","Kaller","Unit conv","Fjäderkurva","Tempdatabladet","KallerTemp","Hyson-Kaller conv"],"not_rendered":{"charts":2,"images":8,"macros":1,"external_links":1,"defined_names":77,"comments":0,"pivot_tables":0},"unopened":[],"bounds":{"document_bytes":16777216,"sheet_cells":100000,"rows_first":2000,"rows_last":500,"rows_between":2000,"halvings":0,"cell_chars":16384,"cell_head_chars":4096},"cells_cut":0,"cells_raw":0,"read":"whole","date_system":"1900"}

{"sheet":"Calculator","index":0,"n_rows":60,"n_cols":34,"rows_kept":60,"cut":false,"hidden":false,"merged":[]}
[null,"Indexval från listor. Input till kod",null,null,null,"Lbox 6","LBox 7","LBox 8",null,null,"Vald produkt",null,null,"Fi","Fs","Fylltryck","Hyson Part nr","Slag"]
[null,"val1","val2","val3",null,"T2L",50,"7 mm",null,null,"T2",50,"7 mm",500,597,180,"T2-50x7",7]
[null,6,1,1,null,"NP",70,"10 mm",null,null,"Kolumn 7 Ska vara StrCode",null,null,"Temperature refecence","Vald produkt"]
[null,null,null,null,null,"T3",90,"12.7 mm",null,null,"T2-50x7",null,null,{"$f":"VLOOKUP(L6,'Hyson-Kaller conv'!C2:D164,2,0)","v":"R12"},"T2-50x7"]
[null,"Lbox 9 Varumärke",null,null,null,"T4",180,"15 mm",null,null,null,{"$f":"FIND(\"x\",K4)","v":6}]
[null,"HYSON",1,"Index",null,"NPL",200,"19 mm",null,null,null,{"$f":"IFERROR(LEFT(K4,L5-1),K4)","v":"T2-50"}]
[null,"FORD",null,null,null,"T2","750P","25 mm"]
[null,"GM",null,null,null,"T3T",null,"38 mm"]
[null,"FCA",null,null,null,"T3F",null,"50 mm",null,null,"Hämtat från temperaturbladet"]
[null,"KALLER",null,null,null,"T4SC",null,"63 mm",null,null,{"$f":"VLOOKUP($N$4,Tempdatabladet!$A$1:$AD$167,16,0)","v":20.774325052322496},null,null,{"$f":"IF(ISERROR(K10),\"Temperature data not available\",\"\")","v":""}]
[null,null,null,null,null,"T5",null,"75 mm",null,null,{"$f":"IF(ISERROR(K12),\"No data\",ROUND(K12,0))","v":21},"om no data",null,"Felmeddelande om tempdata saknas"]
[null,null,null,null,null,"TNKT",null,"80 mm",null,null,{"$f":"'Unit conv'!D66","v":20.774325052322496},"C° eller F°"]
[null,null,null,null,null,"TNKS",null,"100 mm",null,null,null,null,null,null,null,null,null,null,null,null,{"$f":"CONCATENATE(\"Chosen Spring: \",O4)","v":"Chosen Spring: T2-50x7"},null,null,null,null,{"$f":"CONCATENATE(\"HYSON Part Number: \",Q2)","v":"HYSON Part Number: T2-50x7"}]
[null,null,null,null,null,"TNK",null,"125 mm"]
[null,null,null,null,null,"T2B",null,null,null,null,{"$f":"VLOOKUP($N$4,Tempdatabladet!$A$1:$AD$167,17,0)","v":30.774325052322496}]
[null,null,null,null,null,null,null,null,null,null,{"$f":"IF(ISERROR(K17),\"No data\",ROUND(K17,0))","v":31},"om no data",null,null,null,null,null,null,null,null,"Number of Cylinders",null,null,1,"pcs"]
[null,null,null,null,null,null,null,null,null,null,{"$f":"'Unit conv'!D72","v":30.774325052322496},"C° eller F°",null,null,null,null,null,null,null,null,"Filling Pressure",null,null,150,{"$f":"'Unit conv'!B18","v":"bar"},{"$f":"Information_Message_Max_Filling_Pressure","v":"Maximum filling pressure is 180 bar"},null,null,{"$f":"Error_message_High_Pressure","v":""}]
[null,null,null,null,null,null,null,null,null,null,null,null,null,null,null,null,null,null,null,null,"Used Stroke",null,null,5,{"$f":"Used_Length_Unit","v":"mm"},{"$f":"Error_message_Too_long_Used_Stroke_length","v":" "}]
[null,null,null,null,null,null,null,null,null,null,null,null,null,null,null,null,null,null,null,null,"Frequency",null,null,20,"spm"]
[null,null,null,null,null,null,null,null,null,null,null,null,null,null,null,null,null,null,null,null,"Surrounding Temperature",null,null,20,{"$f":"'Unit conv'!B46","v":"°C"}]
[null,null,null,null,null,null,null,"12 in",null,null,null,"Grönmarkerade rutor är ej skyddade för att makrot ska skunna skriva där"]
[null,null,null,null,null,null,null,"25 mm",null,null,null,"User data fält och cell med email länk är upplåst"]
[null,null,null,null,null,null,null,"50 mm",null,null,null,null,null,null,null,null,null,null,null,null,{"$f":"Header_Force_Diagram","v":"Total force of 1 gas spring in kN"},null,null,null,null,null,null,null,null,{"$f":"CONCATENATE(\"Temp \",Used_Temperature_Unit)","v":"Temp °C"}]
[null,null,null,null,null,null,null,"75 mm",null,null,null,"Blåmarkerade celler är ändrade i Hysonsversionen",null,null,null,null,null,null,null,null,null,null,null,null,null,null,null,null,null,null,null,null," "," "]
[null,null,null,null,null,null,null,"80 mm"]
[null,null,null,null,null,null,null,"100 mm"]
[null,null,null,null,null,null,null,"125 mm",null,null,null,null,null,null,null,null,null,null,null,null,null,{"$f":"Min_Temperature_interval-User_Surrounding_temperature","v":1},"Avstånd mellan rumstemp och blå markering"]
[null,null,null,null,null,null,null,"150 mm",null,null,null,null,null,null,null,null,null,null,null,null,null,{"$f":"Max_Temperature_Inteval-Min_Temperature_interval","v":10},"Max temperatur intervall - Mintemperaturintervall"]
[null,null,null,null,null,null,null,"160 mm",null,null,null,null,null,null,null,null,null,null,null,null,null,{"$f":"MAXscale","v":100},"Max skala"]
[null,null,null,null,null,null,null,"175 mm",null,null,null,null,null,null,null,null,null,null,null,null,null,{"$f":"User_Surrounding_temperature+Temperature_over_roomtemp+Temperature_width","v":31},"Total temperatur"]
[null,null,null,null,null,null,null,"200 mm",null,null,null,null,null,null,null,null,null,null,null,null,null,{"$f":"Max_Temperature_Inteval","v":31},"Max temperature interval"]
[null,null,null,null,null,null,null,null,null,null,null,null,null,null,null,null,null,null,null,null,null,{"$f":"MAXscale-Max_Temperature_Inteval","v":69},"Max skala - Max temperature_interval"]
[null,null,null,null,null,null,null,null,null,null,null,null,null,null,null,null,null,null,null,null,null,{"$f":"IF(V32<0,0,V32)","v":69},"Storlek översta diagramblock (transparent)"]
[null,null,null,null,null,null,null,null,null,null,null,null,null,null,null,null,null,null,null,null,null,{"$f":"IF(V33=0,0,Temperature_width)","v":10},"Vidd på blå markering"]
[null,null,null,null,null,null,null,null,null,null,"Hyson ändrat:",null,null,null,null,null,null,null,null,null,null,{"$f":"Min_Temperature_interval-User_Surrounding_temperature","v":1},"Temperature exceding room temp"]
[null,null,null,null,null,null,null,null,null,null,"Logga, färg."]
[null,null,null,null,null,null,null,null,null,null,"texter"]
[null,null,null,null,null,null,null,null,null,null,"mm, tum tillkommer"]
[null,null,null,null,null,null,null,null,null,null,"Hyson partnr tillkommer"]
[null,null,null,null,null,null,null,null,null,null,"Ny visning för kraft och temperatur",null,null,null,null,null,null,null,null,null,null,null,null,{"$f":"CONCATENATE(\"Stroke, \",Y18)","v":"Stroke, mm"}]
[null,null,null,null,null,null,null,null,null,null,null,null,null,null,null,null,null,null,null,null,null,null,null,null,null,null,null,{"$f":"Error_message_High_Temp","v":""}]
[null,null,null,null,null,null,null,null,null,null,null,null,null,null,null,null,null,null,null,null,{"$f":"Information_Message_Force_at_Contact","v":"Force at contact is 0 kN"},null,null,null,null,null,null,{"$f":"Information_Message_Running_Temp","v":"Operating temperature is estimated to be between 21 and 31 °C"}]
[null,null,null,null,null,null,null,null,null,null,null,null,null,null,null,null,null,null,null,null,{"$f":"Information_Message_Force_End_Stroke","v":"Force at 5 mm is 0 kN"}]
[]
[]
[]
[null,null,null,null,null,null,null,null,null,null,null,null,null,null,null,null,null,null,null,null,null,null,null,null,null,null,null,{"$f":"N10","v":""}]
[]
[]
[null,null,null,null,null,null,null,null,null,null,null,null,null,null,null,null,null,null,null,null,"IMPORTANT:"]
[]
[]
[]
[]
[]
[]
[]
[]
[]
[null,null,null,null,null,null,null,null,null,null,null,null,null,null,null,null,null,null,null,null,"Please send feeback and comments to:",null,null,null,"Orders@hysonsolutions.com"]

{"sheet":"Hyson","index":1,"n_rows":1064,"n_cols":12,"rows_kept":1064,"cut":false,"hidden":false,"merged":[]}
[null,null,null,"Family","Size","Stroke","Init Force","Final Force","Max Pres","Str code","mm",{"$f":"J1","v":"Str code"}]
[null,null,null,"T2L",300,"0.25 in",2650,3500,150,"T2L-300x0.25",6.35,{"$f":"J2","v":"T2L-300x0.25"}]
[null,null,null,"T2L",300,"10 mm",2650,3500,150,"T2L-300x10",10,"T2L-300x10"]
[null,null,null,"T2L",300,"0.50 in",2650,3500,150,"T2L-300x0.50",12.7,"T2L-300x0.50"]
[null,null,null,"T2L",300,"16 mm",2650,3500,150,"T2L-300x16",16,"T2L-300x16"]
[null,null,null,"T2L",300,"0.75 in",2650,3500,150,"T2L-300x0.75",19.049999999999997,"T2L-300x0.75"]
[null,null,null,"T2L",300,"25 mm",2650,3500,150,"T2L-300x25",25,"T2L-300x25"]
[null,null,null,"T2L",300,"1.00 in",2650,3500,150,"T2L-300x1.00",25.4,"T2L-300x1.00"]
[null,null,null,"T2L",300,"1.50 in",2650,3500,150,"T2L-300x1.50",38.099999999999994,"T2L-300x1.50"]
[null,null,null,"T2L",300,"50 mm",2650,3500,150,"T2L-300x50",50,"T2L-300x50"]
[null,null,null,"T2L",300,"2.00 in",2650,3500,150,"T2L-300x2.00",50.8,"T2L-300x2.00"]
[null,null,null,"T2L",300,"2.50 in",2650,3500,150,"T2L-300x2.50",63.5,"T2L-300x2.50"]
[null,null,null,"T2L",300,"3.00 in",2650,3500,150,"T2L-300x3.00",76.199999999999989,"T2L-300x3.00"]
[null,null,null,"T2L",300,"80 mm",2650,3500,150,"T2L-300x80",80,"T2L-300x80"]
[null,null,null,"T2L",300,"3.50 in",2650,3500,150,"T2L-300x3.50",88.899999999999991,"T2L-300x3.50"]
[null,null,null,"T2L",300,"100 mm",2650,3500,150,"T2L-300x100",100,"T2L-300x100"]
[null,null,null,"T2L",300,"4.00 in",2650,3500,150,"T2L-300x4.00",101.6,"T2L-300x4.00"]
[null,null,null,"T2L",300,"4.50 in",2650,3500,150,"T2L-300x4.50",114.3,"T2L-300x4.50"]
[null,null,null,"T2L",300,"125 mm",2650,3500,150,"T2L-300x125",125,"T2L-300x125"]
[null,null,null,"T2L",300,"5.00 in",2650,3500,150,"T2L-300x5.00",127,"T2L-300x5.00"]
[null,null,null,"T2L",500,"0.25 in",4700,5600,150,"T2L-500x0.25",6.35,"T2L-500x0.25"]
[null,null,null,"T2L",500,"0.50 in",4700,5900,150,"T2L-500x0.50",12.7,"T2L-500x0.50"]
[null,null,null,"T2L",500,"0.75 in",4700,6100,150,"T2L-500x0.75",19.049999999999997,"T2L-500x0.75"]
[null,null,null,"T2L",500,"1.00 in",4700,6200,150,"T2L-500x1.00",25.4,"T2L-500x1.00"]
[null,null,null,"T2L",500,"1.50 in",4700,6200,150,"T2L-500x1.50",38.099999999999994,"T2L-500x1.50"]
[null,null,null,"T2L",500,"2.00 in",4700,6300,150,"T2L-500x2.00",50.8,"T2L-500x2.00"]
[null,null,null,"T2L",500,"2.50 in",4700,6300,150,"T2L-500x2.50",63.5,"T2L-500x2.50"]
[null,null,null,"T2L",500,"3.00 in",4700,6300,150,"T2L-500x3.00",76.199999999999989,"T2L-500x3.00"]
[null,null,null,"T2L",500,"3.50 in",4700,6600,150,"T2L-500x3.50",88.899999999999991,"T2L-500x3.50"]
[null,null,null,"T2L",500,"4.00 in",4700,6600,150,"T2L-500x4.00",101.6,"T2L-500x4.00"]
[null,null,null,"T2L",500,"4.50 in",4700,6600,150,"T2L-500x4.50",114.3,"T2L-500x4.50"]
[null,null,null,"T2L",500,"5.00 in",4700,6600,150,"T2L-500x5.00",127,"T2L-500x5.00"]
[null,null,null,"T2L",750,"0.25 in",7400,15000,150,"T2L-750x0.25",6.35,"T2L-750x0.25"]
[null,null,null,"T2L",750,"0.50 in",7400,13000,150,"T2L-750x0.50",12.7,"T2L-750x0.50"]
[null,null,null,"T2L",750,"0.75 in",7400,12000,150,"T2L-750x0.75",19.049999999999997,"T2L-750x0.75"]
[null,null,null,"T2L",750,"1.00 in",7400,11000,150,"T2L-750x1.00",25.4,"T2L-750x1.00"]
[null,null,null,"T2L",750,"1.50 in",7400,11000,150,"T2L-750x1.50",38.099999999999994,"T2L-750x1.50"]
[null,null,null,"T2L",750,"2.00 in",7400,11000,150,"T2L-750x2.00",50.8,"T2L-750x2.00"]
[null,null,null,"T2L",750,"2.50 in",7400,11000,150,"T2L-750x2.50",63.5,"T2L-750x2.50"]
[null,null,null,"T2L",750,"3.00 in",7400,11000,150,"T2L-750x3.00",76.199999999999989,"T2L-750x3.00"]
[null,null,null,"T2L",750,"3.50 in",7400,11000,150,"T2L-750x3.50",88.899999999999991,"T2L-750x3.50"]
[null,null,null,"T2L",750,"4.00 in",7400,11000,150,"T2L-750x4.00",101.6,"T2L-750x4.00"]
[null,null,null,"T2L",750,"4.50 in",7400,11000,150,"T2L-750x4.50",114.3,"T2L-750x4.50"]
[null,null,null,"T2L",750,"5.00 in",7400,11000,150,"T2L-750x5.00",127,"T2L-750x5.00"]
[null,null,null,"NP",500,"10 mm",4700,6000,150,"NP-500x10",10,"NP-500x10"]
[null,null,null,"NP",500,"12.7 mm",4700,6100,150,"NP-500x12.7",12.7,"NP-500x12.7"]
[null,null,null,"NP",500,"25 mm",4700,6400,150,"NP-500x25",25,"NP-500x25"]
[null,null,null,"NP",500,"38.1 mm",4700,6500,150,"NP-500x38.1",38.1,"NP-500x38.1"]
[null,null,null,"NP",500,"50 mm",4700,6600,150,"NP-500x50",50,"NP-500x50"]
[null,null,null,"NP",500,"63.5 mm",4700,6600,150,"NP-500x63.5",63.5,"NP-500x63.5"]
[null,null,null,"NP",500,"80 mm",4700,6700,150,"NP-500x80",80,"NP-500x80"]
[null,null,null,"NP",500,"100 mm",4700,6700,150,"NP-500x100",100,"NP-500x100"]
[null,null,null,"NP",500,"125 mm",4700,6700,150,"NP-500x125",125,"NP-500x125"]
[null,null,null,"NP",500,"160 mm",4700,6700,150,"NP-500x160",160,"NP-500x160"]
[null,null,null,"NP",750,"12.7 mm",7400,12000,150,"NP-750x12.7",12.7,"NP-750x12.7"]
[null,null,null,"NP",750,"25 mm",7400,12000,150,"NP-750x25",25,"NP-750x25"]
[null,null,null,"NP",750,"38.1 mm",7400,12000,150,"NP-750x38.1",38.1,"NP-750x38.1"]
[null,null,null,"NP",750,"50 mm",7400,12000,150,"NP-750x50",50,"NP-750x50"]
[null,null,null,"NP",750,"63.5 mm",7400,12000,150,"NP-750x63.5",63.5,"NP-750x63.5"]
[null,null,null,"NP",750,"80 mm",7400,12000,150,"NP-750x80",80,"NP-750x80"]
[null,null,null,"NP",750,"100 mm",7400,12000,150,"NP-750x100",100,"NP-750x100"]
[null,null,null,"NP",750,"125 mm",7400,12100,150,"NP-750x125",125,"NP-750x125"]
[null,null,null,"NP",750,"160 mm",7400,12100,150,"NP-750x160",160,"NP-750x160"]
[null,null,null,"NP",750,"200 mm",7400,12100,150,"NP-750x200",200,"NP-750x200"]
[null,null,null,"NP",750,"250 mm",7400,12100,150,"NP-750x250",250,"NP-750x250"]
[null,null,null,"NP",750,"300 mm",7400,12100,150,"NP-750x300",300,{"$f":"J66","v":"NP-750x300"}]
[null,null,null,"NP",1500,"12.7 mm",15000,23000,150,"NP-1500x12.7",12.7,"NP-1500x12.7"]
[null,null,null,"NP",1500,"25 mm",15000,23000,150,"NP-1500x25",25,"NP-1500x25"]
[null,null,null,"NP",1500,"38.1 mm",15000,23000,150,"NP-1500x38.1",38.1,"NP-1500x38.1"]
[null,null,null,"NP",1500,"50 mm",15000,23000,150,"NP-1500x50",50,"NP-1500x50"]
[null,null,null,"NP",1500,"63.5 mm",15000,23000,150,"NP-1500x63.5",63.5,"NP-1500x63.5"]
[null,null,null,"NP",1500,"80 mm",15000,23000,150,"NP-1500x80",80,"NP-1500x80"]
[null,null,null,"NP",1500,"100 mm",15000,23000,150,"NP-1500x100",100,"NP-1500x100"]
[null,null,null,"NP",1500,"125 mm",15000,23000,150,"NP-1500x125",125,"NP-1500x125"]
[null,null,null,"NP",1500,"160 mm",15000,23000,150,"NP-1500x160",160,"NP-1500x160"]
[null,null,null,"NP",1500,"200 mm",15000,23000,150,"NP-1500x200",200,"NP-1500x200"]
[null,null,null,"NP",1500,"250 mm",15000,23000,150,"NP-1500x250",250,"NP-1500x250"]
[null,null,null,"NP",1500,"300 mm",15000,23000,150,"NP-1500x300",300,"NP-1500x300"]
[null,null,null,"NP",3000,"12.7 mm",30000,42000,150,"NP-3000x12.7",12.7,"NP-3000x12.7"]
[null,null,null,"NP",3000,"25 mm",30000,42000,150,"NP-3000x25",25,"NP-3000x25"]
[null,null,null,"NP",3000,"38.1 mm",30000,43000,150,"NP-3000x38.1",38.1,"NP-3000x38.1"]
[null,null,null,"NP",3000,"50 mm",30000,44000,150,"NP-3000x50",50,"NP-3000x50"]
[null,null,null,"NP",3000,"63.5 mm",30000,45000,150,"NP-3000x63.5",63.5,"NP-3000x63.5"]
[null,null,null,"NP",3000,"80 mm",30000,46000,150,"NP-3000x80",80,"NP-3000x80"]
[null,null,null,"NP",3000,"100 mm",30000,47000,150,"NP-3000x100",100,"NP-3000x100"]
[null,null,null,"NP",3000,"125 mm",30000,47000,150,"NP-3000x125",125,"NP-3000x125"]
[null,null,null,"NP",3000,"160 mm",30000,47000,150,"NP-3000x160",160,"NP-3000x160"]
[null,null,null,"NP",3000,"200 mm",30000,48000,150,"NP-3000x200",200,"NP-3000x200"]
[null,null,null,"NP",3000,"250 mm",30000,48000,150,"NP-3000x250",250,"NP-3000x250"]
[null,null,null,"NP",3000,"300 mm",30000,48000,150,"NP-3000x300",300,"NP-3000x300"]
[null,null,null,"NP",5000,"25 mm",50000,71000,150,"NP-5000x25",25,"NP-5000x25"]
[null,null,null,"NP",5000,"38.1 mm",50000,75000,150,"NP-5000x38.1",38.1,"NP-5000x38.1"]
[null,null,null,"NP",5000,"50 mm",50000,77000,150,"NP-5000x50",50,"NP-5000x50"]
[null,null,null,"NP",5000,"63.5 mm",50000,80000,150,"NP-5000x63.5",63.5,"NP-5000x63.5"]
[null,null,null,"NP",5000,"80 mm",50000,81000,150,"NP-5000x80",80,"NP-5000x80"]
[null,null,null,"NP",5000,"100 mm",50000,82000,150,"NP-5000x100",100,"NP-5000x100"]
[null,null,null,"NP",5000,"125 mm",50000,82000,150,"NP-5000x125",125,"NP-5000x125"]
[null,null,null,"NP",5000,"160 mm",50000,83000,150,"NP-5000x160",160,"NP-5000x160"]
[null,null,null,"NP",5000,"200 mm",50000,84000,150,"NP-5000x200",200,"NP-5000x200"]
[null,null,null,"NP",5000,"250 mm",50000,84000,150,"NP-5000x250",250,"NP-5000x250"]
[null,null,null,"NP",5000,"300 mm",50000,84000,150,"NP-5000x300",300,"NP-5000x300"]
[null,null,null,"NP",7500,"25 mm",75000,105000,150,"NP-7500x25",25,"NP-7500x25"]
[null,null,null,"NP",7500,"38.1 mm",75000,110000,150,"NP-7500x38.1",38.1,"NP-7500x38.1"]
[null,null,null,"NP",7500,"50 mm",75000,113000,150,"NP-7500x50",50,"NP-7500x50"]
[null,null,null,"NP",7500,"63.5 mm",75000,115000,150,"NP-7500x63.5",63.5,"NP-7500x63.5"]
[null,null,null,"NP",7500,"80 mm",75000,117000,150,"NP-7500x80",80,"NP-7500x80"]
[null,null,null,"NP",7500,"100 mm",75000,119000,150,"NP-7500x100",100,"NP-7500x100"]
[null,null,null,"NP",7500,"125 mm",75000,121000,150,"NP-7500x125",125,"NP-7500x125"]
[null,null,null,"NP",7500,"160 mm",75000,122000,150,"NP-7500x160",160,"NP-7500x160"]
[null,null,null,"NP",7500,"200 mm",75000,123000,150,"NP-7500x200",200,"NP-7500x200"]
[null,null,null,"NP",7500,"250 mm",75000,124000,150,"NP-7500x250",250,"NP-7500x250"]
[null,null,null,"NP",7500,"300 mm",75000,124000,150,"NP-7500x300",300,"NP-7500x300"]
[null,null,null,"NP",10000,"25 mm",106000,138000,150,"NP-10000x25",25,"NP-10000x25"]
[null,null,null,"NP",10000,"38.1 mm",106000,143000,150,"NP-10000x38.1",38.1,"NP-10000x38.1"]
[null,null,null,"NP",10000,"50 mm",106000,147000,150,"NP-10000x50",50,"NP-10000x50"]
[null,null,null,"NP",10000,"63.5 mm",106000,150000,150,"NP-10000x63.5",63.5,"NP-10000x63.5"]
[null,null,null,"NP",10000,"80 mm",106000,152000,150,"NP-10000x80",80,"NP-10000x80"]
[null,null,null,"NP",10000,"100 mm",106000,156000,150,"NP-10000x100",100,"NP-10000x100"]
[null,null,null,"NP",10000,"125 mm",106000,157000,150,"NP-10000x125",125,"NP-10000x125"]
[null,null,null,"NP",10000,"160 mm",106000,158000,150,"NP-10000x160",160,"NP-10000x160"]
[null,null,null,"NP",10000,"200 mm",106000,160000,150,"NP-10000x200",200,"NP-10000x200"]
[null,null,null,"NP",10000,"250 mm",106000,160000,150,"NP-10000x250",250,"NP-10000x250"]
[null,null,null,"NP",10000,"300 mm",106000,160000,150,"NP-10000x300",300,"NP-10000x300"]
[null,null,null,"T3",170,"7 mm",1700,2800,180,"T3-170x7",7,"T3-170x7"]
[null,null,null,"T3",170,"10 mm",1700,2800,180,"T3-170x10",10,"T3-170x10"]
[null,null,null,"T3",170,"15 mm",1700,2800,180,"T3-170x15",15,"T3-170x15"]
[null,null,null,"T3",170,"19 mm",1700,2800,180,"T3-170x19",19,"T3-170x19"]
[null,null,null,"T3",170,"25 mm",1700,2800,180,"T3-170x25",25,"T3-170x25"]
[null,null,null,"T3",170,"38 mm",1700,2800,180,"T3-170x38",38,"T3-170x38"]
[null,null,null,"T3",170,"50 mm",1700,2800,180,"T3-170x50",50,{"$f":"J130","v":"T3-170x50"}]
[null,null,null,"T3",170,"63 mm",1700,2800,180,"T3-170x63",63,"T3-170x63"]
[null,null,null,"T3",170,"75 mm",1700,2800,180,"T3-170x75",75,"T3-170x75"]
[null,null,null,"T3",170,"80 mm",1700,2800,180,"T3-170x80",80,"T3-170x80"]
[null,null,null,"T3",170,"100 mm",1700,2800,180,"T3-170x100",100,"T3-170x100"]
[null,null,null,"T3",170,"125 mm",1700,2800,180,"T3-170x125",125,"T3-170x125"]
[null,null,null,"T3",320,"7 mm",3200,4800,180,"T3-320x7",7,"T3-320x7"]
[null,null,null,"T3",320,"10 mm",3200,4900,180,"T3-320x10",10,"T3-320x10"]
[null,null,null,"T3",320,"15 mm",3200,5100,180,"T3-320x15",15,"T3-320x15"]
[null,null,null,"T3",320,"19 mm",3200,5100,180,"T3-320x19",19,"T3-320x19"]
[null,null,null,"T3",320,"25 mm",3200,5200,180,"T3-320x25",25,"T3-320x25"]
[null,null,null,"T3",320,"38 mm",3200,5300,180,"T3-320x38",38,"T3-320x38"]
[null,null,null,"T3",320,"50 mm",3200,5300,180,"T3-320x50",50,"T3-320x50"]
[null,null,null,"T3",320,"63 mm",3200,5300,180,"T3-320x63",63,"T3-320x63"]
[null,null,null,"T3",320,"75 mm",3200,5300,180,"T3-320x75",75,"T3-320x75"]
[null,null,null,"T3",320,"80 mm",3200,5300,180,"T3-320x80",80,"T3-320x80"]
[null,null,null,"T3",320,"100 mm",3200,5300,180,"T3-320x100",100,"T3-320x100"]
[null,null,null,"T3",320,"125 mm",3200,5300,180,"T3-320x125",125,"T3-320x125"]
[null,null,null,"T3",350,"10 mm",3600,5900,180,"T3-350x10",10,"T3-350x10"]
[null,null,null,"T3",350,"13 mm",3600,5200,180,"T3-350x13",13,"T3-350x13"]
[null,null,null,"T3",350,"16 mm",3600,5300,180,"T3-350x16",16,"T3-350x16"]
[null,null,null,"T3",350,"19 mm",3600,5600,180,"T3-350x19",19,"T3-350x19"]
[null,null,null,"T3",350,"25 mm",3600,5500,180,"T3-350x25",25,"T3-350x25"]
[null,null,null,"T3",350,"32 mm",3600,5500,180,"T3-350x32",32,"T3-350x32"]
[null,null,null,"T3",350,"38 mm",3600,5500,180,"T3-350x38",38,"T3-350x38"]
[null,null,null,"T3",350,"50 mm",3600,5500,180,"T3-350x50",50,"T3-350x50"]
[null,null,null,"T3",350,"63 mm",3600,5500,180,"T3-350x63",63,"T3-350x63"]
[null,null,null,"T3",350,"75 mm",3600,5500,180,"T3-350x75",75,"T3-350x75"]
[null,null,null,"T3",350,"80 mm",3600,5500,180,"T3-350x80",80,"T3-350x80"]
[null,null,null,"T3",350,"100 mm",3600,5500,180,"T3-350x100",100,"T3-350x100"]
[null,null,null,"T3",350,"125 mm",3600,5500,180,"T3-350x125",125,"T3-350x125"]
[null,null,null,"T3",500,"10 mm",4700,7200,150,"T3-500x10",10,"T3-500x10"]
[null,null,null,"T3",500,"13 mm",4700,7100,150,"T3-500x13",13,"T3-500x13"]
[null,null,null,"T3",500,"16 mm",4700,7200,150,"T3-500x16",16,"T3-500x16"]
[null,null,null,"T3",500,"19 mm",4700,7400,150,"T3-500x19",19,"T3-500x19"]
[null,null,null,"T3",500,"25 mm",4700,7300,150,"T3-500x25",25,"T3-500x25"]
[null,null,null,"T3",500,"32 mm",4700,7200,150,"T3-500x32",32,"T3-500x32"]
[null,null,null,"T3",500,"38 mm",4700,7200,150,"T3-500x38",38,"T3-500x38"]
[null,null,null,"T3",500,"50 mm",4700,7200,150,"T3-500x50",50,"T3-500x50"]
[null,null,null,"T3",500,"63 mm",4700,7200,150,"T3-500x63",63,"T3-500x63"]
[null,null,null,"T3",500,"75 mm",4700,7100,150,"T3-500x75",75,"T3-500x75"]
[null,null,null,"T3",500,"80 mm",4700,7100,150,"T3-500x80",80,"T3-500x80"]
[null,null,null,"T3",500,"100 mm",4700,7100,150,"T3-500x100",100,"T3-500x100"]
[null,null,null,"T3",500,"125 mm",4700,7100,150,"T3-500x125",125,"T3-500x125"]
[null,null,null,"T3",750,"10 mm",7400,12100,150,"T3-750x10",10,"T3-750x10"]
[null,null,null,"T3",750,"13 mm",7400,12100,150,"T3-750x13",13,"T3-750x13"]
[null,null,null,"T3",750,"16 mm",7400,12100,150,"T3-750x16",16,"T3-750x16"]
[null,null,null,"T3",750,"19 mm",7400,11800,150,"T3-750x19",19,"T3-750x19"]
[null,null,null,"T3",750,"25 mm",7400,11800,150,"T3-750x25",25,"T3-750x25"]
[null,null,null,"T3",750,"32 mm",7400,11800,150,"T3-750x32",32,"T3-750x32"]
[null,null,null,"T3",750,"38 mm",7400,11800,150,"T3-750x38",38,"T3-750x38"]
[null,null,null,"T3",750,"50 mm",7400,11800,150,"T3-750x50",50,"T3-750x50"]
[null,null,null,"T3",750,"63 mm",7400,11800,150,"T3-750x63",63,"T3-750x63"]
[null,null,null,"T3",750,"75 mm",7400,11900,150,"T3-750x75",75,"T3-750x75"]
[null,null,null,"T3",750,"80 mm",7400,11900,150,"T3-750x80",80,"T3-750x80"]
[null,null,null,"T3",750,"100 mm",7400,11900,150,"T3-750x100",100,"T3-750x100"]
[null,null,null,"T3",750,"125 mm",7400,11900,150,"T3-750x125",125,"T3-750x125"]
[null,null,null,"T3",1000,"13 mm",9200,13800,150,"T3-1000x13",13,"T3-1000x13"]
[null,null,null,"T3",1000,"16 mm",9200,13800,150,"T3-1000x16",16,"T3-1000x16"]
[null,null,null,"T3",1000,"19 mm",9200,14000,150,"T3-1000x19",19,"T3-1000x19"]
[null,null,null,"T3",1000,"25 mm",9200,14200,150,"T3-1000x25",25,"T3-1000x25"]
[null,null,null,"T3",1000,"32 mm",9200,14300,150,"T3-1000x32",32,"T3-1000x32"]
[null,null,null,"T3",1000,"38 mm",9200,14500,150,"T3-1000x38",38,"T3-1000x38"]
[null,null,null,"T3",1000,"50 mm",9200,14600,150,"T3-1000x50",50,"T3-1000x50"]
[null,null,null,"T3",1000,"63 mm",9200,14700,150,"T3-1000x63",63,{"$f":"J194","v":"T3-1000x63"}]
[null,null,null,"T3",1000,"75 mm",9200,14700,150,"T3-1000x75",75,"T3-1000x75"]
[null,null,null,"T3",1000,"80 mm",9200,14800,150,"T3-1000x80",80,"T3-1000x80"]
[null,null,null,"T3",1000,"100 mm",9200,14800,150,"T3-1000x100",100,"T3-1000x100"]
[null,null,null,"T3",1000,"125 mm",9200,14800,150,"T3-1000x125",125,"T3-1000x125"]
[null,null,null,"T3",1500,"13 mm",15000,24000,150,"T3-1500x13",13,"T3-1500x13"]
[null,null,null,"T3",1500,"16 mm",15000,24100,150,"T3-1500x16",16,"T3-1500x16"]
[null,null,null,"T3",1500,"19 mm",15000,24200,150,"T3-1500x19",19,"T3-1500x19"]
[null,null,null,"T3",1500,"25 mm",15000,24300,150,"T3-1500x25",25,"T3-1500x25"]
[null,null,null,"T3",1500,"32 mm",15000,23800,150,"T3-1500x32",32,"T3-1500x32"]
[null,null,null,"T3",1500,"38 mm",15000,23900,150,"T3-1500x38",38,"T3-1500x38"]
[null,null,null,"T3",1500,"50 mm",15000,24000,150,"T3-1500x50",50,"T3-1500x50"]
[null,null,null,"T3",1500,"63 mm",15000,24100,150,"T3-1500x63",63,"T3-1500x63"]
[null,null,null,"T3",1500,"75 mm",15000,24200,150,"T3-1500x75",75,"T3-1500x75"]
[null,null,null,"T3",1500,"80 mm",15000,24200,150,"T3-1500x80",80,"T3-1500x80"]
[null,null,null,"T3",1500,"100 mm",15000,24300,150,"T3-1500x100",100,"T3-1500x100"]
[null,null,null,"T3",1500,"125 mm",15000,24300,150,"T3-1500x125",125,"T3-1500x125"]
[null,null,null,"T3",2400,"16 mm",24000,38300,150,"T3-2400x16",16,"T3-2400x16"]
[null,null,null,"T3",2400,"19 mm",24000,38500,150,"T3-2400x19",19,"T3-2400x19"]
[null,null,null,"T3",2400,"25 mm",24000,38700,150,"T3-2400x25",25,"T3-2400x25"]
[null,null,null,"T3",2400,"32 mm",24000,38600,150,"T3-2400x32",32,"T3-2400x32"]
[null,null,null,"T3",2400,"38 mm",24000,38400,150,"T3-2400x38",38,"T3-2400x38"]
[null,null,null,"T3",2400,"50 mm",24000,39200,150,"T3-2400x50",50,"T3-2400x50"]
[null,null,null,"T3",2400,"63 mm",24000,39200,150,"T3-2400x63",63,"T3-2400x63"]
[null,null,null,"T3",2400,"75 mm",24000,39200,150,"T3-2400x75",75,"T3-2400x75"]
[null,null,null,"T3",2400,"80 mm",24000,39200,150,"T3-2400x80",80,"T3-2400x80"]
[null,null,null,"T3",2400,"100 mm",24000,39300,150,"T3-2400x100",100,"T3-2400x100"]
[null,null,null,"T3",2400,"125 mm",24000,39300,150,"T3-2400x125",125,"T3-2400x125"]
[null,null,null,"T3",4200,"16 mm",42000,61700,150,"T3-4200x16",16,"T3-4200x16"]
[null,null,null,"T3",4200,"19 mm",42000,63700,150,"T3-4200x19",19,"T3-4200x19"]
[null,null,null,"T3",4200,"25 mm",42000,60800,150,"T3-4200x25",25,"T3-4200x25"]
[null,null,null,"T3",4200,"32 mm",42000,64300,150,"T3-4200x32",32,"T3-4200x32"]
[null,null,null,"T3",4200,"38 mm",42000,65800,150,"T3-4200x38",38,"T3-4200x38"]
[null,null,null,"T3",4200,"50 mm",42000,67000,150,"T3-4200x50",50,"T3-4200x50"]
[null,null,null,"T3",4200,"63 mm",42000,67800,150,"T3-4200x63",63,"T3-4200x63"]
[null,null,null,"T3",4200,"75 mm",42000,68000,150,"T3-4200x75",75,"T3-4200x75"]
[null,null,null,"T3",4200,"80 mm",42000,68600,150,"T3-4200x80",80,"T3-4200x80"]
[null,null,null,"T3",4200,"100 mm",42000,69100,150,"T3-4200x100",100,"T3-4200x100"]
[null,null,null,"T3",4200,"125 mm",42000,69600,150,"T3-4200x125",125,"T3-4200x125"]
[null,null,null,"T3",6600,"16 mm",66300,89000,150,"T3-6600x16",16,"T3-6600x16"]
[null,null,null,"T3",6600,"19 mm",66300,91000,150,"T3-6600x19",19,"T3-6600x19"]
[null,null,null,"T3",6600,"25 mm",66300,93900,150,"T3-6600x25",25,"T3-6600x25"]
[null,null,null,"T3",6600,"32 mm",66300,96100,150,"T3-6600x32",32,"T3-6600x32"]
[null,null,null,"T3",6600,"38 mm",66300,98200,150,"T3-6600x38",38,"T3-6600x38"]
[null,null,null,"T3",6600,"50 mm",66300,100600,150,"T3-6600x50",50,"T3-6600x50"]
[null,null,null,"T3",6600,"63 mm",66300,102400,150,"T3-6600x63",63,"T3-6600x63"]
[null,null,null,"T3",6600,"75 mm",66300,103400,150,"T3-6600x75",75,"T3-6600x75"]
[null,null,null,"T3",6600,"80 mm",66300,104100,150,"T3-6600x80",80,"T3-6600x80"]
[null,null,null,"T3",6600,"100 mm",66300,105400,150,"T3-6600x100",100,"T3-6600x100"]
[null,null,null,"T3",6600,"125 mm",66300,106500,150,"T3-6600x125",125,"T3-6600x125"]
[null,null,null,"T3",9500,"19 mm",95000,135000,150,"T3-9500x19",19,"T3-9500x19"]
[null,null,null,"T3",9500,"25 mm",95000,139000,150,"T3-9500x25",25,"T3-9500x25"]
[null,null,null,"T3",9500,"32 mm",95000,142000,150,"T3-9500x32",32,"T3-9500x32"]
[null,null,null,"T3",9500,"38 mm",95000,143000,150,"T3-9500x38",38,"T3-9500x38"]
[null,null,null,"T3",9500,"50 mm",95000,146000,150,"T3-9500x50",50,"T3-9500x50"]
[null,null,null,"T3",9500,"63 mm",95000,148000,150,"T3-9500x63",63,"T3-9500x63"]
[null,null,null,"T3",9500,"75 mm",95000,149000,150,"T3-9500x75",75,"T3-9500x75"]
[null,null,null,"T3",9500,"80 mm",95000,150000,150,"T3-9500x80",80,"T3-9500x80"]
[null,null,null,"T3",9500,"100 mm",95000,151000,150,"T3-9500x100",100,"T3-9500x100"]
[null,null,null,"T3",9500,"125 mm",95000,152000,150,"T3-9500x125",125,"T3-9500x125"]
[null,null,null,"T3",20000,"19 mm",200000,259000,150,"T3-20000x19",19,"T3-20000x19"]
[null,null,null,"T3",20000,"25 mm",200000,270000,150,"T3-20000x25",25,"T3-20000x25"]
[null,null,null,"T3",20000,"32 mm",200000,280000,150,"T3-20000x32",32,"T3-20000x32"]
[null,null,null,"T3",20000,"38 mm",200000,287000,150,"T3-20000x38",38,"T3-20000x38"]
[null,null,null,"T3",20000,"50 mm",200000,298000,150,"T3-20000x50",50,{"$f":"J258","v":"T3-20000x50"}]
[null,null,null,"T3",20000,"63 mm",200000,307000,150,"T3-20000x63",63,"T3-20000x63"]
[null,null,null,"T3",20000,"75 mm",200000,313000,150,"T3-20000x75",75,"T3-20000x75"]
[null,null,null,"T3",20000,"80 mm",200000,315000,150,"T3-20000x80",80,"T3-20000x80"]
[null,null,null,"T3",20000,"100 mm",200000,323000,150,"T3-20000x100",100,"T3-20000x100"]
[null,null,null,"T3",20000,"125 mm",200000,330000,150,"T3-20000x125",125,"T3-20000x125"]
[null,null,null,"T4",750,"12.7 mm",7400,12000,150,"T4-750x12.7",12.7,"T4-750x12.7"]
[null,null,null,"T4",750,"25 mm",7400,12000,150,"T4-750x25",25,"T4-750x25"]
[null,null,null,"T4",750,"38.1 mm",7400,12000,150,"T4-750x38.1",38.1,"T4-750x38.1"]
[null,null,null,"T4",750,"50 mm",7400,12000,150,"T4-750x50",50,"T4-750x50"]
[null,null,null,"T4",750,"63.5 mm",7400,12000,150,"T4-750x63.5",63.5,"T4-750x63.5"]
[null,null,null,"T4",750,"75 mm",7400,12000,150,"T4-750x75",75,"T4-750x75"]
[null,null,null,"T4",750,"80 mm",7400,12000,150,"T4-750x80",80,"T4-750x80"]
[null,null,null,"T4",750,"100 mm",7400,12000,150,"T4-750x100",100,"T4-750x100"]
[null,null,null,"T4",750,"125 mm",7400,12100,150,"T4-750x125",125,"T4-750x125"]
[null,null,null,"T4",750,"150 mm",7400,12100,150,"T4-750x150",150,"T4-750x150"]
[null,null,null,"T4",750,"160 mm",7400,12100,150,"T4-750x160",160,"T4-750x160"]
[null,null,null,"T4",750,"175 mm",7400,12000,150,"T4-750x175",175,"T4-750x175"]
[null,null,null,"T4",750,"200 mm",7400,12100,150,"T4-750x200",200,"T4-750x200"]
[null,null,null,"T4",1000,"12.7 mm",9200,11200,150,"T4-1000x12.7",12.7,"T4-1000x12.7"]
[null,null,null,"T4",1000,"25 mm",9200,12100,150,"T4-1000x25",25,"T4-1000x25"]
[null,null,null,"T4",1000,"38.1 mm",9200,12800,150,"T4-1000x38.1",38.1,"T4-1000x38.1"]
[null,null,null,"T4",1000,"50 mm",9200,13200,150,"T4-1000x50",50,"T4-1000x50"]
[null,null,null,"T4",1000,"63.5 mm",9200,13500,150,"T4-1000x63.5",63.5,"T4-1000x63.5"]
[null,null,null,"T4",1000,"75 mm",9200,13700,150,"T4-1000x75",75,"T4-1000x75"]
[null,null,null,"T4",1000,"80 mm",9200,13800,150,"T4-1000x80",80,"T4-1000x80"]
[null,null,null,"T4",1000,"100 mm",9200,14100,150,"T4-1000x100",100,"T4-1000x100"]
[null,null,null,"T4",1000,"125 mm",9200,14300,150,"T4-1000x125",125,"T4-1000x125"]
[null,null,null,"T4",1000,"150 mm",9200,14500,150,"T4-1000x150",150,"T4-1000x150"]
[null,null,null,"T4",1000,"160 mm",9200,14500,150,"T4-1000x160",160,"T4-1000x160"]
[null,null,null,"T4",1000,"175 mm",9200,14600,150,"T4-1000x175",175,"T4-1000x175"]
[null,null,null,"T4",1000,"200 mm",9200,14700,150,"T4-1000x200",200,"T4-1000x200"]
[null,null,null,"T4",1000,"250 mm",9200,14800,150,"T4-1000x250",250,"T4-1000x250"]
[null,null,null,"T4",1000,"300 mm",9200,14900,150,"T4-1000x300",300,"T4-1000x300"]
[null,null,null,"T4",1500,"12.7 mm",15000,17700,150,"T4-1500x12.7",12.7,"T4-1500x12.7"]
[null,null,null,"T4",1500,"25 mm",15000,19100,150,"T4-1500x25",25,"T4-1500x25"]
[null,null,null,"T4",1500,"38.1 mm",15000,20000,150,"T4-1500x38.1",38.1,"T4-1500x38.1"]
[null,null,null,"T4",1500,"50 mm",15000,20600,150,"T4-1500x50",50,"T4-1500x50"]
[null,null,null,"T4",1500,"63.5 mm",15000,21100,150,"T4-1500x63.5",63.5,"T4-1500x63.5"]
[null,null,null,"T4",1500,"75 mm",15000,21500,150,"T4-1500x75",75,"T4-1500x75"]
[null,null,null,"T4",1500,"80 mm",15000,21600,150,"T4-1500x80",80,"T4-1500x80"]
[null,null,null,"T4",1500,"100 mm",15000,21700,150,"T4-1500x100",100,"T4-1500x100"]
[null,null,null,"T4",1500,"125 mm",15000,22400,150,"T4-1500x125",125,"T4-1500x125"]
[null,null,null,"T4",1500,"150 mm",15000,22500,150,"T4-1500x150",150,"T4-1500x150"]
[null,null,null,"T4",1500,"160 mm",15000,22600,150,"T4-1500x160",160,"T4-1500x160"]
[null,null,null,"T4",1500,"175 mm",15000,22600,150,"T4-1500x175",175,"T4-1500x175"]
[null,null,null,"T4",1500,"200 mm",15000,22800,150,"T4-1500x200",200,"T4-1500x200"]
[null,null,null,"T4",1500,"250 mm",15000,23000,150,"T4-1500x250",250,"T4-1500x250"]
[null,null,null,"T4",1500,"300 mm",15000,23200,150,"T4-1500x300",300,"T4-1500x300"]
[null,null,null,"T4",2400,"25 mm",24000,37100,150,"T4-2400x25",25,"T4-2400x25"]
[null,null,null,"T4",2400,"38.1 mm",24000,37600,150,"T4-2400x38.1",38.1,"T4-2400x38.1"]
[null,null,null,"T4",2400,"50 mm",24000,37900,150,"T4-2400x50",50,"T4-2400x50"]
[null,null,null,"T4",2400,"63.5 mm",24000,38100,150,"T4-2400x63.5",63.5,"T4-2400x63.5"]
[null,null,null,"T4",2400,"75 mm",24000,38300,150,"T4-2400x75",75,"T4-2400x75"]
[null,null,null,"T4",2400,"80 mm",24000,38300,150,"T4-2400x80",80,"T4-2400x80"]
[null,null,null,"T4",2400,"100 mm",24000,38500,150,"T4-2400x100",100,"T4-2400x100"]
[null,null,null,"T4",2400,"125 mm",24000,38700,150,"T4-2400x125",125,"T4-2400x125"]
[null,null,null,"T4",2400,"150 mm",24000,38800,150,"T4-2400x150",150,"T4-2400x150"]
[null,null,null,"T4",2400,"160 mm",24000,38800,150,"T4-2400x160",160,"T4-2400x160"]
[null,null,null,"T4",2400,"175 mm",24000,38900,150,"T4-2400x175",175,"T4-2400x175"]
[null,null,null,"T4",2400,"200 mm",24000,38900,150,"T4-2400x200",200,"T4-2400x200"]
[null,null,null,"T4",2400,"250 mm",24000,39000,150,"T4-2400x250",250,"T4-2400x250"]
[null,null,null,"T4",2400,"300 mm",24000,39100,150,"T4-2400x300",300,"T4-2400x300"]
[null,null,null,"T4",4200,"25 mm",42000,52100,150,"T4-4200x25",25,"T4-4200x25"]
[null,null,null,"T4",4200,"38.1 mm",42000,55100,150,"T4-4200x38.1",38.1,{"$f":"J322","v":"T4-4200x38.1"}]
[null,null,null,"T4",4200,"50 mm",42000,57200,150,"T4-4200x50",50,"T4-4200x50"]
[null,null,null,"T4",4200,"63.5 mm",42000,59000,150,"T4-4200x63.5",63.5,"T4-4200x63.5"]
[null,null,null,"T4",4200,"75 mm",42000,60300,150,"T4-4200x75",75,"T4-4200x75"]
[null,null,null,"T4",4200,"80 mm",42000,60800,150,"T4-4200x80",80,"T4-4200x80"]
[null,null,null,"T4",4200,"100 mm",42000,62500,150,"T4-4200x100",100,"T4-4200x100"]
[null,null,null,"T4",4200,"125 mm",42000,64000,150,"T4-4200x125",125,"T4-4200x125"]
[null,null,null,"T4",4200,"150 mm",42000,65100,150,"T4-4200x150",150,"T4-4200x150"]
[null,null,null,"T4",4200,"160 mm",42000,65500,150,"T4-4200x160",160,"T4-4200x160"]
[null,null,null,"T4",4200,"175 mm",42000,66000,150,"T4-4200x175",175,"T4-4200x175"]
[null,null,null,"T4",4200,"200 mm",42000,66800,150,"T4-4200x200",200,"T4-4200x200"]
[null,null,null,"T4",4200,"250 mm",42000,67900,150,"T4-4200x250",250,"T4-4200x250"]
[null,null,null,"T4",4200,"300 mm",42000,68700,150,"T4-4200x300",300,"T4-4200x300"]
[null,null,null,"T4",6600,"25 mm",66300,79500,150,"T4-6600x25",25,"T4-6600x25"]
[null,null,null,"T4",6600,"38.1 mm",66300,83900,150,"T4-6600x38.1",38.1,"T4-6600x38.1"]
[null,null,null,"T4",6600,"50 mm",66300,87000,150,"T4-6600x50",50,"T4-6600x50"]
[null,null,null,"T4",6600,"63.5 mm",66300,89700,150,"T4-6600x63.5",63.5,"T4-6600x63.5"]
[null,null,null,"T4",6600,"75 mm",66300,91800,150,"T4-6600x75",75,"T4-6600x75"]
[null,null,null,"T4",6600,"80 mm",66300,92600,150,"T4-6600x80",80,"T4-6600x80"]
[null,null,null,"T4",6600,"100 mm",66300,95100,150,"T4-6600x100",100,"T4-6600x100"]
[null,null,null,"T4",6600,"125 mm",66300,97600,150,"T4-6600x125",125,"T4-6600x125"]
[null,null,null,"T4",6600,"150 mm",66300,99500,150,"T4-6600x150",150,"T4-6600x150"]
[null,null,null,"T4",6600,"160 mm",66300,100100,150,"T4-6600x160",160,"T4-6600x160"]
[null,null,null,"T4",6600,"175 mm",66300,101000,150,"T4-6600x175",175,"T4-6600x175"]
[null,null,null,"T4",6600,"200 mm",66300,102200,150,"T4-6600x200",200,"T4-6600x200"]
[null,null,null,"T4",6600,"250 mm",66300,104000,150,"T4-6600x250",250,"T4-6600x250"]
[null,null,null,"T4",6600,"300 mm",66300,105300,150,"T4-6600x300",300,"T4-6600x300"]
[null,null,null,"T4",9500,"25 mm",95000,113200,150,"T4-9500x25",25,"T4-9500x25"]
[null,null,null,"T4",9500,"38.1 mm",95000,119000,150,"T4-9500x38.1",38.1,"T4-9500x38.1"]
[null,null,null,"T4",9500,"50 mm",95000,123300,150,"T4-9500x50",50,"T4-9500x50"]
[null,null,null,"T4",9500,"63.5 mm",95000,127000,150,"T4-9500x63.5",63.5,"T4-9500x63.5"]
[null,null,null,"T4",9500,"75 mm",95000,129700,150,"T4-9500x75",75,"T4-9500x75"]
[null,null,null,"T4",9500,"80 mm",95000,130800,150,"T4-9500x80",80,"T4-9500x80"]
[null,null,null,"T4",9500,"100 mm",95000,134300,150,"T4-9500x100",100,"T4-9500x100"]
[null,null,null,"T4",9500,"125 mm",95000,137600,150,"T4-9500x125",125,"T4-9500x125"]
[null,null,null,"T4",9500,"150 mm",95000,140200,150,"T4-9500x150",150,"T4-9500x150"]
[null,null,null,"T4",9500,"160 mm",95000,141000,150,"T4-9500x160",160,"T4-9500x160"]
[null,null,null,"T4",9500,"175 mm",95000,142200,150,"T4-9500x175",175,"T4-9500x175"]
[null,null,null,"T4",9500,"200 mm",95000,143800,150,"T4-9500x200",200,"T4-9500x200"]
[null,null,null,"T4",9500,"250 mm",95000,146300,150,"T4-9500x250",250,"T4-9500x250"]
[null,null,null,"T4",9500,"300 mm",95000,148200,150,"T4-9500x300",300,"T4-9500x300"]
[null,null,null,"T4",20000,"25 mm",200000,242000,150,"T4-20000x25",25,"T4-20000x25"]
[null,null,null,"T4",20000,"38.1 mm",200000,256400,150,"T4-20000x38.1",38.1,"T4-20000x38.1"]
[null,null,null,"T4",20000,"50 mm",200000,266800,150,"T4-20000x50",50,"T4-20000x50"]
[null,null,null,"T4",20000,"63.5 mm",200000,276000,150,"T4-20000x63.5",63.5,"T4-20000x63.5"]
[null,null,null,"T4",20000,"80 mm",200000,285700,150,"T4-20000x80",80,"T4-20000x80"]
[null,null,null,"T4",20000,"100 mm",200000,294600,150,"T4-20000x100",100,"T4-20000x100"]
[null,null,null,"T4",20000,"125 mm",200000,303100,150,"T4-20000x125",125,"T4-20000x125"]
[null,null,null,"T4",20000,"160 mm",200000,312000,150,"T4-20000x160",160,"T4-20000x160"]
[null,null,null,"T4",20000,"200 mm",200000,319000,150,"T4-20000x200",200,"T4-20000x200"]
[null,null,null,"T4",20000,"250 mm",200000,325600,150,"T4-20000x250",250,"T4-20000x250"]
[null,null,null,"T4",20000,"300 mm",200000,330600,150,"T4-20000x300",300,"T4-20000x300"]
[null,null,null,"NPL",750,"12.5 mm",7400,11400,150,"NPL-750x12.5",12.5,"NPL-750x12.5"]
[null,null,null,"NPL",750,"25 mm",7400,11700,150,"NPL-750x25",25,"NPL-750x25"]
[null,null,null,"NPL",750,"37.5 mm",7400,11800,150,"NPL-750x37.5",37.5,"NPL-750x37.5"]
[null,null,null,"NPL",750,"50 mm",7400,11900,150,"NPL-750x50",50,"NPL-750x50"]
[null,null,null,"NPL",750,"62.5 mm",7400,11900,150,"NPL-750x62.5",62.5,"NPL-750x62.5"]
[null,null,null,"NPL",750,"75 mm",7400,11900,150,"NPL-750x75",75,"NPL-750x75"]
[null,null,null,"NPL",750,"80 mm",7400,11900,150,"NPL-750x80",80,"NPL-750x80"]
[null,null,null,"NPL",750,"87.5 mm",7400,11900,150,"NPL-750x87.5",87.5,"NPL-750x87.5"]
[null,null,null,"NPL",750,"100 mm",7400,11900,150,"NPL-750x100",100,"NPL-750x100"]
[null,null,null,"NPL",750,"112.5 mm",7400,12000,150,"NPL-750x112.5",112.5,"NPL-750x112.5"]
[null,null,null,"NPL",750,"125 mm",7400,12000,150,"NPL-750x125",125,"NPL-750x125"]
[null,null,null,"NPL",750,"137.5 mm",7400,12000,150,"NPL-750x137.5",137.5,"NPL-750x137.5"]
[null,null,null,"NPL",750,"150 mm",7400,12000,150,"NPL-750x150",150,{"$f":"J386","v":"NPL-750x150"}]
[null,null,null,"NPL",750,"160 mm",7400,12000,150,"NPL-750x160",160,"NPL-750x160"]
[null,null,null,"NPL",750,"175 mm",7400,12000,150,"NPL-750x175",175,"NPL-750x175"]
[null,null,null,"NPL",750,"200 mm",7400,12000,150,"NPL-750x200",200,"NPL-750x200"]
[null,null,null,"NPL",750,"225 mm",7400,12000,150,"NPL-750x225",225,"NPL-750x225"]
[null,null,null,"NPL",750,"250 mm",7400,12000,150,"NPL-750x250",250,"NPL-750x250"]
[null,null,null,"NPL",1500,"12.5 mm",15000,18000,150,"NPL-1500x12.5",12.5,"NPL-1500x12.5"]
[null,null,null,"NPL",1500,"25 mm",15000,19200,150,"NPL-1500x25",25,"NPL-1500x25"]
[null,null,null,"NPL",1500,"37.5 mm",15000,20000,150,"NPL-1500x37.5",37.5,"NPL-1500x37.5"]
[null,null,null,"NPL",1500,"50 mm",15000,20400,150,"NPL-1500x50",50,"NPL-1500x50"]
[null,null,null,"NPL",1500,"62.5 mm",15000,20700,150,"NPL-1500x62.5",62.5,"NPL-1500x62.5"]
[null,null,null,"NPL",1500,"75 mm",15000,20900,150,"NPL-1500x75",75,"NPL-1500x75"]
[null,null,null,"NPL",1500,"80 mm",15000,21000,150,"NPL-1500x80",80,"NPL-1500x80"]
[null,null,null,"NPL",1500,"87.5 mm",15000,21100,150,"NPL-1500x87.5",87.5,"NPL-1500x87.5"]
[null,null,null,"NPL",1500,"100 mm",15000,21200,150,"NPL-1500x100",100,"NPL-1500x100"]
[null,null,null,"NPL",1500,"112.5 mm",15000,21400,150,"NPL-1500x112.5",112.5,"NPL-1500x112.5"]
[null,null,null,"NPL",1500,"125 mm",15000,21500,150,"NPL-1500x125",125,"NPL-1500x125"]
[null,null,null,"NPL",1500,"137.5 mm",15000,22000,150,"NPL-1500x137.5",137.5,"NPL-1500x137.5"]
[null,null,null,"NPL",1500,"150 mm",15000,22000,150,"NPL-1500x150",150,"NPL-1500x150"]
[null,null,null,"NPL",1500,"160 mm",15000,22100,150,"NPL-1500x160",160,"NPL-1500x160"]
[null,null,null,"NPL",1500,"175 mm",15000,22100,150,"NPL-1500x175",175,"NPL-1500x175"]
[null,null,null,"NPL",1500,"200 mm",15000,22100,150,"NPL-1500x200",200,"NPL-1500x200"]
[null,null,null,"NPL",1500,"225 mm",15000,22200,150,"NPL-1500x225",225,"NPL-1500x225"]
[null,null,null,"NPL",1500,"250 mm",15000,22200,150,"NPL-1500x250",250,"NPL-1500x250"]
[null,null,null,"NPL",3000,"12.5 mm",30000,38700,150,"NPL-3000x12.5",12.5,"NPL-3000x12.5"]
[null,null,null,"NPL",3000,"25 mm",30000,41800,150,"NPL-3000x25",25,"NPL-3000x25"]
[null,null,null,"NPL",3000,"37.5 mm",30000,43500,150,"NPL-3000x37.5",37.5,"NPL-3000x37.5"]
[null,null,null,"NPL",3000,"50 mm",30000,44400,150,"NPL-3000x50",50,"NPL-3000x50"]
[null,null,null,"NPL",3000,"62.5 mm",30000,45100,150,"NPL-3000x62.5",62.5,"NPL-3000x62.5"]
[null,null,null,"NPL",3000,"75 mm",30000,45500,150,"NPL-3000x75",75,"NPL-3000x75"]
[null,null,null,"NPL",3000,"80 mm",30000,45600,150,"NPL-3000x80",80,"NPL-3000x80"]
[null,null,null,"NPL",3000,"87.5 mm",30000,45800,150,"NPL-3000x87.5",87.5,"NPL-3000x87.5"]
[null,null,null,"NPL",3000,"100 mm",30000,46100,150,"NPL-3000x100",100,"NPL-3000x100"]
[null,null,null,"NPL",3000,"112.5 mm",30000,46300,150,"NPL-3000x112.5",112.5,"NPL-3000x112.5"]
[null,null,null,"NPL",3000,"125 mm",30000,46500,150,"NPL-3000x125",125,"NPL-3000x125"]
[null,null,null,"NPL",3000,"137.5 mm",30000,46600,150,"NPL-3000x137.5",137.5,"NPL-3000x137.5"]
[null,null,null,"NPL",3000,"150 mm",30000,46800,150,"NPL-3000x150",150,"NPL-3000x150"]
[null,null,null,"NPL",3000,"160 mm",30000,46900,150,"NPL-3000x160",160,"NPL-3000x160"]
[null,null,null,"NPL",3000,"175 mm",30000,47000,150,"NPL-3000x175",175,"NPL-3000x175"]
[null,null,null,"NPL",3000,"200 mm",30000,47100,150,"NPL-3000x200",200,"NPL-3000x200"]
[null,null,null,"NPL",3000,"225 mm",30000,47200,150,"NPL-3000x225",225,"NPL-3000x225"]
[null,null,null,"NPL",3000,"250 mm",30000,47300,150,"NPL-3000x250",250,"NPL-3000x250"]
[null,null,null,"NPL",5000,"25 mm",50000,80100,150,"NPL-5000x25",25,"NPL-5000x25"]
[null,null,null,"NPL",5000,"37.5 mm",50000,81900,150,"NPL-5000x37.5",37.5,"NPL-5000x37.5"]
[null,null,null,"NPL",5000,"50 mm",50000,82800,150,"NPL-5000x50",50,"NPL-5000x50"]
[null,null,null,"NPL",5000,"62.5 mm",50000,83500,150,"NPL-5000x62.5",62.5,"NPL-5000x62.5"]
[null,null,null,"NPL",5000,"75 mm",50000,83800,150,"NPL-5000x75",75,"NPL-5000x75"]
[null,null,null,"NPL",5000,"80 mm",50000,84000,150,"NPL-5000x80",80,"NPL-5000x80"]
[null,null,null,"NPL",5000,"87.5 mm",50000,84100,150,"NPL-5000x87.5",87.5,"NPL-5000x87.5"]
[null,null,null,"NPL",5000,"100 mm",50000,84400,150,"NPL-5000x100",100,"NPL-5000x100"]
[null,null,null,"NPL",5000,"112.5 mm",50000,84500,150,"NPL-5000x112.5",112.5,"NPL-5000x112.5"]
[null,null,null,"NPL",5000,"125 mm",50000,84700,150,"NPL-5000x125",125,"NPL-5000x125"]
[null,null,null,"NPL",5000,"137.5 mm",50000,84800,150,"NPL-5000x137.5",137.5,"NPL-5000x137.5"]
[null,null,null,"NPL",5000,"150 mm",50000,84900,150,"NPL-5000x150",150,"NPL-5000x150"]
[null,null,null,"NPL",5000,"160 mm",50000,85000,150,"NPL-5000x160",160,"NPL-5000x160"]
[null,null,null,"NPL",5000,"175 mm",50000,85100,150,"NPL-5000x175",175,"NPL-5000x175"]
[null,null,null,"NPL",5000,"200 mm",50000,85200,150,"NPL-5000x200",200,"NPL-5000x200"]
[null,null,null,"NPL",5000,"225 mm",50000,85300,150,"NPL-5000x225",225,"NPL-5000x225"]
[null,null,null,"NPL",5000,"250 mm",50000,85400,150,"NPL-5000x250",250,"NPL-5000x250"]
[null,null,null,"NPL",7500,"25 mm",75000,99900,150,"NPL-7500x25",25,"NPL-7500x25"]
[null,null,null,"NPL",7500,"37.5 mm",75000,104100,150,"NPL-7500x37.5",37.5,"NPL-7500x37.5"]
[null,null,null,"NPL",7500,"50 mm",75000,106800,150,"NPL-7500x50",50,"NPL-7500x50"]
[null,null,null,"NPL",7500,"62.5 mm",75000,108700,150,"NPL-7500x62.5",62.5,"NPL-7500x62.5"]
[null,null,null,"NPL",7500,"75 mm",75000,110100,150,"NPL-7500x75",75,"NPL-7500x75"]
[null,null,null,"NPL",7500,"80 mm",75000,115600,150,"NPL-7500x80",80,{"$f":"J450","v":"NPL-7500x80"}]
[null,null,null,"NPL",7500,"87.5 mm",75000,111200,150,"NPL-7500x87.5",87.5,"NPL-7500x87.5"]
[null,null,null,"NPL",7500,"100 mm",75000,112000,150,"NPL-7500x100",100,"NPL-7500x100"]
[null,null,null,"NPL",7500,"112.5 mm",75000,112700,150,"NPL-7500x112.5",112.5,"NPL-7500x112.5"]
[null,null,null,"NPL",7500,"125 mm",75000,113300,150,"NPL-7500x125",125,"NPL-7500x125"]
[null,null,null,"NPL",7500,"137.5 mm",75000,113700,150,"NPL-7500x137.5",137.5,"NPL-7500x137.5"]
[null,null,null,"NPL",7500,"150 mm",75000,114100,150,"NPL-7500x150",150,"NPL-7500x150"]
[null,null,null,"NPL",7500,"160 mm",75000,114400,150,"NPL-7500x160",160,"NPL-7500x160"]
[null,null,null,"NPL",7500,"175 mm",75000,114800,150,"NPL-7500x175",175,"NPL-7500x175"]
[null,null,null,"NPL",7500,"200 mm",75000,115300,150,"NPL-7500x200",200,"NPL-7500x200"]
[null,null,null,"NPL",7500,"225 mm",75000,115700,150,"NPL-7500x225",225,"NPL-7500x225"]
[null,null,null,"NPL",7500,"250 mm",75000,116000,150,"NPL-7500x250",250,"NPL-7500x250"]
[null,null,null,"T2",50,"7 mm",500,597,180,"T2-50x7",7,"T2-50x7"]
[null,null,null,"T2",50,"10 mm",500,634,180,"T2-50x10",10,"T2-50x10"]
[null,null,null,"T2",50,"12.7 mm",500,657,180,"T2-50x12.7",12.7,"T2-50x12.7"]
[null,null,null,"T2",50,"15 mm",500,670,180,"T2-50x15",15,"T2-50x15"]
[null,null,null,"T2",50,"19 mm",500,689,180,"T2-50x19",19,"T2-50x19"]
[null,null,null,"T2",50,"25 mm",500,707,180,"T2-50x25",25,"T2-50x25"]
[null,null,null,"T2",50,"38 mm",500,730,180,"T2-50x38",38,"T2-50x38"]
[null,null,null,"T2",50,"50 mm",500,742,180,"T2-50x50",50,"T2-50x50"]
[null,null,null,"T2",50,"63 mm",500,789,180,"T2-50x63",63,"T2-50x63"]
[null,null,null,"T2",50,"75 mm",500,788,180,"T2-50x75",75,"T2-50x75"]
[null,null,null,"T2",50,"80 mm",500,827,180,"T2-50x80",80,"T2-50x80"]
[null,null,null,"T2",50,"100 mm",500,817,180,"T2-50x100",100,"T2-50x100"]
[null,null,null,"T2",50,"125 mm",500,810,180,"T2-50x125",125,"T2-50x125"]
[null,null,null,"T2",70,"7 mm",700,865,180,"T2-70x7",7,"T2-70x7"]
[null,null,null,"T2",70,"10 mm",700,895,180,"T2-70x10",10,"T2-70x10"]
[null,null,null,"T2",70,"12.7 mm",700,914,180,"T2-70x12.7",12.7,"T2-70x12.7"]
[null,null,null,"T2",70,"15 mm",700,927,180,"T2-70x15",15,"T2-70x15"]
[null,null,null,"T2",70,"19 mm",700,943,180,"T2-70x19",19,"T2-70x19"]
[null,null,null,"T2",70,"25 mm",700,961,180,"T2-70x25",25,"T2-70x25"]
[null,null,null,"T2",70,"38 mm",700,1032,180,"T2-70x38",38,"T2-70x38"]
[null,null,null,"T2",70,"50 mm",700,1033,180,"T2-70x50",50,"T2-70x50"]
[null,null,null,"T2",70,"63 mm",700,1092,180,"T2-70x63",63,"T2-70x63"]
[null,null,null,"T2",70,"75 mm",700,1082,180,"T2-70x75",75,"T2-70x75"]
[null,null,null,"T2",70,"80 mm",700,1079,180,"T2-70x80",80,"T2-70x80"]
[null,null,null,"T2",70,"100 mm",700,1069,180,"T2-70x100",100,"T2-70x100"]
[null,null,null,"T2",70,"125 mm",700,1062,180,"T2-70x125",125,"T2-70x125"]
[null,null,null,"T2",90,"7 mm",900,1600,180,"T2-90x7",7,"T2-90x7"]
[null,null,null,"T2",90,"10 mm",900,1400,180,"T2-90x10",10,"T2-90x10"]
[null,null,null,"T2",90,"15 mm",900,1300,180,"T2-90x15",15,"T2-90x15"]
[null,null,null,"T2",90,"25 mm",900,1300,180,"T2-90x25",25,"T2-90x25"]
[null,null,null,"T2",90,"38.1 mm",900,1200,180,"T2-90x38.1",38.1,"T2-90x38.1"]
[null,null,null,"T2",90,"50 mm",900,1200,180,"T2-90x50",50,"T2-90x50"]
[null,null,null,"T2",90,"63.5 mm",900,1200,180,"T2-90x63.5",63.5,"T2-90x63.5"]
[null,null,null,"T2",90,"80 mm",900,1200,180,"T2-90x80",80,"T2-90x80"]
[null,null,null,"T2",90,"100 mm",900,1200,180,"T2-90x100",100,"T2-90x100"]
[null,null,null,"T2",90,"125 mm",900,1200,180,"T2-90x125",125,"T2-90x125"]
[null,null,null,"T2",180,"10 mm",2000,3060,180,"T2-180x10",10,"T2-180x10"]
[null,null,null,"T2",180,"12.7 mm",2000,3070,180,"T2-180x12.7",12.7,"T2-180x12.7"]
[null,null,null,"T2",180,"15 mm",2000,3070,180,"T2-180x15",15,"T2-180x15"]
[null,null,null,"T2",180,"16 mm",2000,3070,180,"T2-180x16",16,"T2-180x16"]
[null,null,null,"T2",180,"25 mm",2000,3080,180,"T2-180x25",25,"T2-180x25"]
[null,null,null,"T2",180,"38.1 mm",2000,3090,180,"T2-180x38.1",38.1,"T2-180x38.1"]
[null,null,null,"T2",180,"50 mm",2000,3090,180,"T2-180x50",50,"T2-180x50"]
[null,null,null,"T2",180,"63.5 mm",2000,3020,180,"T2-180x63.5",63.5,"T2-180x63.5"]
[null,null,null,"T2",180,"80 mm",2000,3040,180,"T2-180x80",80,"T2-180x80"]
[null,null,null,"T2",180,"100 mm",2000,3050,180,"T2-180x100",100,"T2-180x100"]
[null,null,null,"T2",180,"125 mm",2000,3060,180,"T2-180x125",125,"T2-180x125"]
[null,null,null,"T2",200,"10 mm",2000,3060,180,"T2-200x10",10,"T2-200x10"]
[null,null,null,"T2",200,"12.7 mm",2000,3070,180,"T2-200x12.7",12.7,"T2-200x12.7"]
[null,null,null,"T2",200,"16 mm",2000,3070,180,"T2-200x16",16,"T2-200x16"]
[null,null,null,"T2",200,"25 mm",2000,3080,180,"T2-200x25",25,"T2-200x25"]
[null,null,null,"T2",200,"38.1 mm",2000,3090,180,"T2-200x38.1",38.1,"T2-200x38.1"]
[null,null,null,"T2",200,"50 mm",2000,3090,180,"T2-200x50",50,{"$f":"J514","v":"T2-200x50"}]
[null,null,null,"T2",200,"63.5 mm",2000,3020,180,"T2-200x63.5",63.5,"T2-200x63.5"]
[null,null,null,"T2",200,"80 mm",2000,3040,180,"T2-200x80",80,"T2-200x80"]
[null,null,null,"T2",200,"100 mm",2000,3050,180,"T2-200x100",100,"T2-200x100"]
[null,null,null,"T2",200,"125 mm",2000,3060,180,"T2-200x125",125,"T2-200x125"]
[null,null,null,"T3T",350,"10 mm",3600,5900,180,"T3T-350x10",10,"T3T-350x10"]
[null,null,null,"T3T",350,"13 mm",3600,5200,180,"T3T-350x13",13,"T3T-350x13"]
[null,null,null,"T3T",350,"16 mm",3600,5300,180,"T3T-350x16",16,"T3T-350x16"]
[null,null,null,"T3T",350,"19 mm",3600,5600,180,"T3T-350x19",19,"T3T-350x19"]
[null,null,null,"T3T",350,"25 mm",3600,5500,180,"T3T-350x25",25,"T3T-350x25"]
[null,null,null,"T3T",350,"32 mm",3600,5500,180,"T3T-350x32",32,"T3T-350x32"]
[null,null,null,"T3T",350,"38 mm",3600,5500,180,"T3T-350x38",38,"T3T-350x38"]
[null,null,null,"T3T",350,"50 mm",3600,5600,180,"T3T-350x50",50,"T3T-350x50"]
[null,null,null,"T3T",350,"63 mm",3600,5500,180,"T3T-350x63",63,"T3T-350x63"]
[null,null,null,"T3T",350,"75 mm",3600,5500,180,"T3T-350x75",75,"T3T-350x75"]
[null,null,null,"T3T",350,"80 mm",3600,5500,180,"T3T-350x80",80,"T3T-350x80"]
[null,null,null,"T3T",350,"100 mm",3600,5500,180,"T3T-350x100",100,"T3T-350x100"]
[null,null,null,"T3T",350,"125 mm",3600,5500,180,"T3T-350x125",125,"T3T-350x125"]
[null,null,null,"T3T",500,"10 mm",4700,7200,150,"T3T-500x10",10,"T3T-500x10"]
[null,null,null,"T3T",500,"13 mm",4700,7100,150,"T3T-500x13",13,"T3T-500x13"]
[null,null,null,"T3T",500,"16 mm",4700,7200,150,"T3T-500x16",16,"T3T-500x16"]
[null,null,null,"T3T",500,"19 mm",4700,7400,150,"T3T-500x19",19,"T3T-500x19"]
[null,null,null,"T3T",500,"25 mm",4700,7300,150,"T3T-500x25",25,"T3T-500x25"]
[null,null,null,"T3T",500,"32 mm",4700,7200,150,"T3T-500x32",32,"T3T-500x32"]
[null,null,null,"T3T",500,"38 mm",4700,7200,150,"T3T-500x38",38,"T3T-500x38"]
[null,null,null,"T3T",500,"50 mm",4700,7200,150,"T3T-500x50",50,"T3T-500x50"]
[null,null,null,"T3T",500,"63 mm",4700,7200,150,"T3T-500x63",63,"T3T-500x63"]
[null,null,null,"T3T",500,"75 mm",4700,7100,150,"T3T-500x75",75,"T3T-500x75"]
[null,null,null,"T3T",500,"80 mm",4700,7100,150,"T3T-500x80",80,"T3T-500x80"]
[null,null,null,"T3T",500,"100 mm",4700,7100,150,"T3T-500x100",100,"T3T-500x100"]
[null,null,null,"T3T",500,"125 mm",4700,7100,150,"T3T-500x125",125,"T3T-500x125"]
[null,null,null,"T3T",750,"10 mm",7400,12100,150,"T3T-750x10",10,"T3T-750x10"]
[null,null,null,"T3T",750,"13 mm",7400,12100,150,"T3T-750x13",13,"T3T-750x13"]
[null,null,null,"T3T",750,"16 mm",7400,12100,150,"T3T-750x16",16,"T3T-750x16"]
[null,null,null,"T3T",750,"19 mm",7400,11700,150,"T3T-750x19",19,"T3T-750x19"]
[null,null,null,"T3T",750,"25 mm",7400,11800,150,"T3T-750x25",25,"T3T-750x25"]
[null,null,null,"T3T",750,"32 mm",7400,11800,150,"T3T-750x32",32,"T3T-750x32"]
[null,null,null,"T3T",750,"38 mm",7400,11800,150,"T3T-750x38",38,"T3T-750x38"]
[null,null,null,"T3T",750,"50 mm",7400,11800,150,"T3T-750x50",50,"T3T-750x50"]
[null,null,null,"T3T",750,"63 mm",7400,11800,150,"T3T-750x63",63,"T3T-750x63"]
[null,null,null,"T3T",750,"75 mm",7400,11900,150,"T3T-750x75",75,"T3T-750x75"]
[null,null,null,"T3T",750,"80 mm",7400,11900,150,"T3T-750x80",80,"T3T-750x80"]
[null,null,null,"T3T",750,"100 mm",7400,11900,150,"T3T-750x100",100,"T3T-750x100"]
[null,null,null,"T3T",750,"125 mm",7400,11900,150,"T3T-750x125",125,"T3T-750x125"]
[null,null,null,"T3T",1000,"13 mm",9200,13800,150,"T3T-1000x13",13,"T3T-1000x13"]
[null,null,null,"T3T",1000,"16 mm",9200,13800,150,"T3T-1000x16",16,"T3T-1000x16"]
[null,null,null,"T3T",1000,"19 mm",9200,14000,150,"T3T-1000x19",19,"T3T-1000x19"]
[null,null,null,"T3T",1000,"25 mm",9200,14200,150,"T3T-1000x25",25,"T3T-1000x25"]
[null,null,null,"T3T",1000,"32 mm",9200,14300,150,"T3T-1000x32",32,"T3T-1000x32"]
[null,null,null,"T3T",1000,"38 mm",9200,14500,150,"T3T-1000x38",38,"T3T-1000x38"]
[null,null,null,"T3T",1000,"50 mm",9200,14600,180,"T3T-1000x50",50,"T3T-1000x50"]
[null,null,null,"T3T",1000,"63 mm",9200,14700,180,"T3T-1000x63",63,"T3T-1000x63"]
[null,null,null,"T3T",1000,"75 mm",9200,14700,180,"T3T-1000x75",75,"T3T-1000x75"]
[null,null,null,"T3T",1000,"80 mm",9200,14800,180,"T3T-1000x80",80,"T3T-1000x80"]
[null,null,null,"T3T",1000,"100 mm",9200,14800,180,"T3T-1000x100",100,"T3T-1000x100"]
[null,null,null,"T3T",1000,"125 mm",9200,14800,180,"T3T-1000x125",125,"T3T-1000x125"]
[null,null,null,"T3T",1500,"13 mm",15000,24000,180,"T3T-1500x13",13,"T3T-1500x13"]
[null,null,null,"T3T",1500,"16 mm",15000,24100,150,"T3T-1500x16",16,"T3T-1500x16"]
[null,null,null,"T3T",1500,"19 mm",15000,24200,150,"T3T-1500x19",19,"T3T-1500x19"]
[null,null,null,"T3T",1500,"25 mm",15000,24300,150,"T3T-1500x25",25,"T3T-1500x25"]
[null,null,null,"T3T",1500,"32 mm",15000,23800,150,"T3T-1500x32",32,"T3T-1500x32"]
[null,null,null,"T3T",1500,"38 mm",15000,23900,150,"T3T-1500x38",38,"T3T-1500x38"]
[null,null,null,"T3T",1500,"50 mm",15000,24000,150,"T3T-1500x50",50,"T3T-1500x50"]
[null,null,null,"T3T",1500,"63 mm",15000,24100,150,"T3T-1500x63",63,"T3T-1500x63"]
[null,null,null,"T3T",1500,"75 mm",15000,24200,150,"T3T-1500x75",75,{"$f":"J578","v":"T3T-1500x75"}]
[null,null,null,"T3T",1500,"80 mm",15000,24200,150,"T3T-1500x80",80,"T3T-1500x80"]
[null,null,null,"T3T",1500,"100 mm",15000,24300,150,"T3T-1500x100",100,"T3T-1500x100"]
[null,null,null,"T3T",1500,"125 mm",15000,24300,150,"T3T-1500x125",125,"T3T-1500x125"]
[null,null,null,"T3T",2400,"16 mm",24000,38300,150,"T3T-2400x16",16,"T3T-2400x16"]
[null,null,null,"T3T",2400,"19 mm",24000,38500,150,"T3T-2400x19",19,"T3T-2400x19"]
[null,null,null,"T3T",2400,"25 mm",24000,38700,150,"T3T-2400x25",25,"T3T-2400x25"]
[null,null,null,"T3T",2400,"32 mm",24000,38600,150,"T3T-2400x32",32,"T3T-2400x32"]
[null,null,null,"T3T",2400,"38 mm",24000,38400,150,"T3T-2400x38",38,"T3T-2400x38"]
[null,null,null,"T3T",2400,"50 mm",24000,39200,150,"T3T-2400x50",50,"T3T-2400x50"]
[null,null,null,"T3T",2400,"63 mm",24000,39200,150,"T3T-2400x63",63,"T3T-2400x63"]
[null,null,null,"T3T",2400,"75 mm",24000,39200,150,"T3T-2400x75",75,"T3T-2400x75"]
[null,null,null,"T3T",2400,"80 mm",24000,39200,150,"T3T-2400x80",80,"T3T-2400x80"]
[null,null,null,"T3T",2400,"100 mm",24000,39300,150,"T3T-2400x100",100,"T3T-2400x100"]
[null,null,null,"T3T",2400,"125 mm",24000,39300,150,"T3T-2400x125",125,"T3T-2400x125"]
[null,null,null,"T3T",4200,"16 mm",42000,61700,150,"T3T-4200x16",16,"T3T-4200x16"]
[null,null,null,"T3T",4200,"19 mm",42000,63700,150,"T3T-4200x19",19,"T3T-4200x19"]
[null,null,null,"T3T",4200,"25 mm",42000,60800,150,"T3T-4200x25",25,"T3T-4200x25"]
[null,null,null,"T3T",4200,"32 mm",42000,64300,150,"T3T-4200x32",32,"T3T-4200x32"]
[null,null,null,"T3T",4200,"38 mm",42000,65800,150,"T3T-4200x38",38,"T3T-4200x38"]
[null,null,null,"T3T",4200,"50 mm",42000,67000,150,"T3T-4200x50",50,"T3T-4200x50"]
[null,null,null,"T3T",4200,"63 mm",42000,67800,150,"T3T-4200x63",63,"T3T-4200x63"]
[null,null,null,"T3T",4200,"75 mm",42000,68000,150,"T3T-4200x75",75,"T3T-4200x75"]
[null,null,null,"T3T",4200,"80 mm",42000,68600,150,"T3T-4200x80",80,"T3T-4200x80"]
[null,null,null,"T3T",4200,"100 mm",42000,69100,150,"T3T-4200x100",100,"T3T-4200x100"]
[null,null,null,"T3T",4200,"125 mm",42000,69600,150,"T3T-4200x125",125,"T3T-4200x125"]
[null,null,null,"T3T",6600,"16 mm",66300,89000,150,"T3T-6600x16",16,"T3T-6600x16"]
[null,null,null,"T3T",6600,"19 mm",66300,91000,150,"T3T-6600x19",19,"T3T-6600x19"]
[null,null,null,"T3T",6600,"25 mm",66300,93900,150,"T3T-6600x25",25,"T3T-6600x25"]
[null,null,null,"T3T",6600,"32 mm",66300,96100,150,"T3T-6600x32",32,"T3T-6600x32"]
[null,null,null,"T3T",6600,"38 mm",66300,98200,150,"T3T-6600x38",38,"T3T-6600x38"]
[null,null,null,"T3T",6600,"50 mm",66300,100600,150,"T3T-6600x50",50,"T3T-6600x50"]
[null,null,null,"T3T",6600,"63 mm",66300,102400,150,"T3T-6600x63",63,"T3T-6600x63"]
[null,null,null,"T3T",6600,"75 mm",66300,103400,150,"T3T-6600x75",75,"T3T-6600x75"]
[null,null,null,"T3T",6600,"80 mm",66300,104100,150,"T3T-6600x80",80,"T3T-6600x80"]
[null,null,null,"T3T",6600,"100 mm",66300,105400,150,"T3T-6600x100",100,"T3T-6600x100"]
[null,null,null,"T3T",6600,"125 mm",66300,106500,150,"T3T-6600x125",125,"T3T-6600x125"]
[null,null,null,"T3T",9500,"19 mm",95000,135000,150,"T3T-9500x19",19,"T3T-9500x19"]
[null,null,null,"T3T",9500,"25 mm",95000,139000,150,"T3T-9500x25",25,"T3T-9500x25"]
[null,null,null,"T3T",9500,"32 mm",95000,142000,150,"T3T-9500x32",32,"T3T-9500x32"]
[null,null,null,"T3T",9500,"38 mm",95000,143000,150,"T3T-9500x38",38,"T3T-9500x38"]
[null,null,null,"T3T",9500,"50 mm",95000,146000,150,"T3T-9500x50",50,"T3T-9500x50"]
[null,null,null,"T3T",9500,"63 mm",95000,148000,150,"T3T-9500x63",63,"T3T-9500x63"]
[null,null,null,"T3T",9500,"75 mm",95000,149000,150,"T3T-9500x75",75,"T3T-9500x75"]
[null,null,null,"T3T",9500,"80 mm",95000,150000,150,"T3T-9500x80",80,"T3T-9500x80"]
[null,null,null,"T3T",9500,"100 mm",95000,151000,150,"T3T-9500x100",100,"T3T-9500x100"]
[null,null,null,"T3T",9500,"125 mm",95000,152000,150,"T3T-9500x125",125,"T3T-9500x125"]
[null,null,null,"T3F",750,"10 mm",7400,12100,150,"T3F-750x10",10,"T3F-750x10"]
[null,null,null,"T3F",750,"13 mm",7400,12100,150,"T3F-750x13",13,"T3F-750x13"]
[null,null,null,"T3F",750,"16 mm",7400,12100,150,"T3F-750x16",16,"T3F-750x16"]
[null,null,null,"T3F",750,"19 mm",7400,11800,150,"T3F-750x19",19,"T3F-750x19"]
[null,null,null,"T3F",750,"25 mm",7400,11800,150,"T3F-750x25",25,"T3F-750x25"]
[null,null,null,"T3F",750,"32 mm",7400,11800,150,"T3F-750x32",32,"T3F-750x32"]
[null,null,null,"T3F",750,"38 mm",7400,11800,150,"T3F-750x38",38,"T3F-750x38"]
[null,null,null,"T3F",750,"50 mm",7400,11800,150,"T3F-750x50",50,"T3F-750x50"]
[null,null,null,"T3F",750,"63 mm",7400,11800,150,"T3F-750x63",63,"T3F-750x63"]
[null,null,null,"T3F",750,"75 mm",7400,11900,150,"T3F-750x75",75,"T3F-750x75"]
[null,null,null,"T3F",750,"80 mm",7400,11900,150,"T3F-750x80",80,"T3F-750x80"]
[null,null,null,"T3F",750,"100 mm",7400,11900,150,"T3F-750x100",100,"T3F-750x100"]
[null,null,null,"T3F",750,"125 mm",7400,11900,150,"T3F-750x125",125,"T3F-750x125"]
[null,null,null,"T3F",1000,"13 mm",9200,13800,150,"T3F-1000x13",13,"T3F-1000x13"]
[null,null,null,"T3F",1000,"16 mm",9200,13800,150,"T3F-1000x16",16,"T3F-1000x16"]
[null,null,null,"T3F",1000,"19 mm",9200,14000,150,"T3F-1000x19",19,"T3F-1000x19"]
[null,null,null,"T3F",1000,"25 mm",9200,14200,150,"T3F-1000x25",25,"T3F-1000x25"]
[null,null,null,"T3F",1000,"32 mm",9200,14300,150,"T3F-1000x32",32,{"$f":"J642","v":"T3F-1000x32"}]
[null,null,null,"T3F",1000,"38 mm",9200,14500,150,"T3F-1000x38",38,"T3F-1000x38"]
[null,null,null,"T3F",1000,"50 mm",9200,14600,150,"T3F-1000x50",50,"T3F-1000x50"]
[null,null,null,"T3F",1000,"63 mm",9200,14700,150,"T3F-1000x63",63,"T3F-1000x63"]
[null,null,null,"T3F",1000,"75 mm",9200,14700,150,"T3F-1000x75",75,"T3F-1000x75"]
[null,null,null,"T3F",1000,"80 mm",9200,14800,150,"T3F-1000x80",80,"T3F-1000x80"]
[null,null,null,"T3F",1000,"100 mm",9200,14800,150,"T3F-1000x100",100,"T3F-1000x100"]
[null,null,null,"T3F",1000,"125 mm",9200,14800,150,"T3F-1000x125",125,"T3F-1000x125"]
[null,null,null,"T3F",1500,"13 mm",15000,24000,150,"T3F-1500x13",13,"T3F-1500x13"]
[null,null,null,"T3F",1500,"16 mm",15000,24100,150,"T3F-1500x16",16,"T3F-1500x16"]
[null,null,null,"T3F",1500,"19 mm",15000,24200,150,"T3F-1500x19",19,"T3F-1500x19"]
[null,null,null,"T3F",1500,"25 mm",15000,24300,150,"T3F-1500x25",25,"T3F-1500x25"]
[null,null,null,"T3F",1500,"32 mm",15000,23800,150,"T3F-1500x32",32,"T3F-1500x32"]
[null,null,null,"T3F",1500,"38 mm",15000,23900,150,"T3F-1500x38",38,"T3F-1500x38"]
[null,null,null,"T3F",1500,"50 mm",15000,24000,150,"T3F-1500x50",50,"T3F-1500x50"]
[null,null,null,"T3F",1500,"63 mm",15000,24100,150,"T3F-1500x63",63,"T3F-1500x63"]
[null,null,null,"T3F",1500,"75 mm",15000,24200,150,"T3F-1500x75",75,"T3F-1500x75"]
[null,null,null,"T3F",1500,"80 mm",15000,24200,150,"T3F-1500x80",80,"T3F-1500x80"]
[null,null,null,"T3F",1500,"100 mm",15000,24300,150,"T3F-1500x100",100,"T3F-1500x100"]
[null,null,null,"T3F",1500,"125 mm",15000,24300,150,"T3F-1500x125",125,"T3F-1500x125"]
[null,null,null,"T3F",2400,"16 mm",24000,38300,150,"T3F-2400x16",16,"T3F-2400x16"]
[null,null,null,"T3F",2400,"19 mm",24000,38500,150,"T3F-2400x19",19,"T3F-2400x19"]
[null,null,null,"T3F",2400,"25 mm",24000,38700,150,"T3F-2400x25",25,"T3F-2400x25"]
[null,null,null,"T3F",2400,"32 mm",24000,38600,150,"T3F-2400x32",32,"T3F-2400x32"]
[null,null,null,"T3F",2400,"38 mm",24000,38400,150,"T3F-2400x38",38,"T3F-2400x38"]
[null,null,null,"T3F",2400,"50 mm",24000,39200,150,"T3F-2400x50",50,"T3F-2400x50"]
[null,null,null,"T3F",2400,"63 mm",24000,39200,150,"T3F-2400x63",63,"T3F-2400x63"]
[null,null,null,"T3F",2400,"75 mm",24000,39200,150,"T3F-2400x75",75,"T3F-2400x75"]
[null,null,null,"T3F",2400,"80 mm",24000,39200,150,"T3F-2400x80",80,"T3F-2400x80"]
[null,null,null,"T3F",2400,"100 mm",24000,39300,150,"T3F-2400x100",100,"T3F-2400x100"]
[null,null,null,"T3F",2400,"125 mm",24000,39300,150,"T3F-2400x125",125,"T3F-2400x125"]
[null,null,null,"T4SC",420,"6 mm",4250,7300,150,"T4SC-420x6",6,"T4SC-420x6"]
[null,null,null,"T4SC",420,"10 mm",4250,7300,150,"T4SC-420x10",10,"T4SC-420x10"]
[null,null,null,"T4SC",420,"16 mm",4250,7300,150,"T4SC-420x16",16,"T4SC-420x16"]
[null,null,null,"T4SC",420,"25 mm",4250,7400,150,"T4SC-420x25",25,"T4SC-420x25"]
[null,null,null,"T4SC",420,"32 mm",4250,7900,150,"T4SC-420x32",32,"T4SC-420x32"]
[null,null,null,"T4SC",420,"40 mm",4250,8000,150,"T4SC-420x40",40,"T4SC-420x40"]
[null,null,null,"T4SC",420,"50 mm",4250,8000,150,"T4SC-420x50",50,"T4SC-420x50"]
[null,null,null,"T4SC",740,"6 mm",7400,10000,150,"T4SC-740x6",6,"T4SC-740x6"]
[null,null,null,"T4SC",740,"10 mm",7400,10000,150,"T4SC-740x10",10,"T4SC-740x10"]
[null,null,null,"T4SC",740,"16 mm",7400,11000,150,"T4SC-740x16",16,"T4SC-740x16"]
[null,null,null,"T4SC",740,"25 mm",7400,12000,150,"T4SC-740x25",25,"T4SC-740x25"]
[null,null,null,"T4SC",740,"32 mm",7400,12000,150,"T4SC-740x32",32,"T4SC-740x32"]
[null,null,null,"T4SC",740,"40 mm",7400,12000,150,"T4SC-740x40",40,"T4SC-740x40"]
[null,null,null,"T4SC",740,"50 mm",7400,12000,150,"T4SC-740x50",50,"T4SC-740x50"]
[null,null,null,"T4SC",1000,"6 mm",10600,16000,150,"T4SC-1000x6",6,"T4SC-1000x6"]
[null,null,null,"T4SC",1000,"10 mm",10600,16000,180,"T4SC-1000x10",10,"T4SC-1000x10"]
[null,null,null,"T4SC",1000,"16 mm",10600,16000,180,"T4SC-1000x16",16,"T4SC-1000x16"]
[null,null,null,"T4SC",1000,"25 mm",10600,16000,180,"T4SC-1000x25",25,"T4SC-1000x25"]
[null,null,null,"T4SC",1000,"32 mm",10600,16000,180,"T4SC-1000x32",32,"T4SC-1000x32"]
[null,null,null,"T4SC",1000,"40 mm",10600,16000,180,"T4SC-1000x40",40,"T4SC-1000x40"]
[null,null,null,"T4SC",1000,"50 mm",10600,16000,180,"T4SC-1000x50",50,"T4SC-1000x50"]
[null,null,null,"T4SC",1800,"6 mm",18000,24000,180,"T4SC-1800x6",6,"T4SC-1800x6"]
[null,null,null,"T4SC",1800,"10 mm",18000,25000,180,"T4SC-1800x10",10,"T4SC-1800x10"]
[null,null,null,"T4SC",1800,"16 mm",18000,25000,150,"T4SC-1800x16",16,"T4SC-1800x16"]
[null,null,null,"T4SC",1800,"25 mm",18000,26000,150,"T4SC-1800x25",25,"T4SC-1800x25"]
[null,null,null,"T4SC",1800,"32 mm",18000,26000,150,"T4SC-1800x32",32,"T4SC-1800x32"]
[null,null,null,"T4SC",1800,"40 mm",18000,26000,150,"T4SC-1800x40",40,"T4SC-1800x40"]
[null,null,null,"T4SC",1800,"50 mm",18000,27000,150,"T4SC-1800x50",50,"T4SC-1800x50"]
[null,null,null,"T4SC",1800,"65 mm",18000,28000,150,"T4SC-1800x65",65,"T4SC-1800x65"]
[null,null,null,"T4SC",2900,"10 mm",29500,40000,150,"T4SC-2900x10",10,"T4SC-2900x10"]
[null,null,null,"T4SC",2900,"16 mm",29500,42000,150,"T4SC-2900x16",16,"T4SC-2900x16"]
[null,null,null,"T4SC",2900,"25 mm",29500,45000,150,"T4SC-2900x25",25,"T4SC-2900x25"]
[null,null,null,"T4SC",2900,"32 mm",29500,46200,150,"T4SC-2900x32",32,"T4SC-2900x32"]
[null,null,null,"T4SC",2900,"40 mm",29500,47200,150,"T4SC-2900x40",40,{"$f":"J706","v":"T4SC-2900x40"}]
[null,null,null,"T4SC",2900,"50 mm",29500,45000,150,"T4SC-2900x50",50,"T4SC-2900x50"]
[null,null,null,"T4SC",2900,"65 mm",29500,47000,150,"T4SC-2900x65",65,"T4SC-2900x65"]
[null,null,null,"T4SC",4700,"10 mm",47000,67000,150,"T4SC-4700x10",10,"T4SC-4700x10"]
[null,null,null,"T4SC",4700,"16 mm",47000,66000,150,"T4SC-4700x16",16,"T4SC-4700x16"]
[null,null,null,"T4SC",4700,"25 mm",47000,68000,150,"T4SC-4700x25",25,"T4SC-4700x25"]
[null,null,null,"T4SC",4700,"32 mm",47000,67000,150,"T4SC-4700x32",32,"T4SC-4700x32"]
[null,null,null,"T4SC",4700,"40 mm",47000,67000,150,"T4SC-4700x40",40,"T4SC-4700x40"]
[null,null,null,"T4SC",4700,"50 mm",47000,67000,150,"T4SC-4700x50",50,"T4SC-4700x50"]
[null,null,null,"T4SC",4700,"65 mm",47000,71000,150,"T4SC-4700x65",65,"T4SC-4700x65"]
[null,null,null,"T4SC",7500,"10 mm",75000,98500,150,"T4SC-7500x10",10,"T4SC-7500x10"]
[null,null,null,"T4SC",7500,"16 mm",75000,100000,150,"T4SC-7500x16",16,"T4SC-7500x16"]
[null,null,null,"T4SC",7500,"25 mm",75000,104000,150,"T4SC-7500x25",25,"T4SC-7500x25"]
[null,null,null,"T4SC",7500,"32 mm",75000,102000,150,"T4SC-7500x32",32,"T4SC-7500x32"]
[null,null,null,"T4SC",7500,"40 mm",75000,104000,150,"T4SC-7500x40",40,"T4SC-7500x40"]
[null,null,null,"T4SC",7500,"50 mm",75000,103000,150,"T4SC-7500x50",50,"T4SC-7500x50"]
[null,null,null,"T4SC",7500,"65 mm",75000,111000,150,"T4SC-7500x65",65,"T4SC-7500x65"]
[null,null,null,"T4SC",11800,"10 mm",118000,150000,150,"T4SC-11800x10",10,"T4SC-11800x10"]
[null,null,null,"T4SC",11800,"16 mm",118000,153000,150,"T4SC-11800x16",16,"T4SC-11800x16"]
[null,null,null,"T4SC",11800,"25 mm",118000,160000,150,"T4SC-11800x25",25,"T4SC-11800x25"]
[null,null,null,"T4SC",11800,"32 mm",118000,165000,150,"T4SC-11800x32",32,"T4SC-11800x32"]
[null,null,null,"T4SC",11800,"40 mm",118000,160000,150,"T4SC-11800x40",40,"T4SC-11800x40"]
[null,null,null,"T4SC",11800,"50 mm",118000,161000,150,"T4SC-11800x50",50,"T4SC-11800x50"]
[null,null,null,"T4SC",11800,"65 mm",118000,163000,150,"T4SC-11800x65",65,"T4SC-11800x65"]
[null,null,null,"T4SC",18300,"10 mm",183000,227000,150,"T4SC-18300x10",10,"T4SC-18300x10"]
[null,null,null,"T4SC",18300,"16 mm",183000,233000,150,"T4SC-18300x16",16,"T4SC-18300x16"]
[null,null,null,"T4SC",18300,"25 mm",183000,244000,150,"T4SC-18300x25",25,"T4SC-18300x25"]
[null,null,null,"T4SC",18300,"32 mm",183000,244000,150,"T4SC-18300x32",32,"T4SC-18300x32"]
[null,null,null,"T4SC",18300,"40 mm",183000,244000,150,"T4SC-18300x40",40,"T4SC-18300x40"]
[null,null,null,"T4SC",18300,"50 mm",183000,248000,150,"T4SC-18300x50",50,"T4SC-18300x50"]
[null,null,null,"T4SC",18300,"65 mm",183000,253000,150,"T4SC-18300x65",65,"T4SC-18300x65"]
[null,null,null,"T5",500,"10 mm",5100,6600,200,"T5-500x10",10,"T5-500x10"]
[null,null,null,"T5",500,"15 mm",5100,7100,200,"T5-500x15",15,"T5-500x15"]
[null,null,null,"T5",500,"25 mm",5100,7900,200,"T5-500x25",25,"T5-500x25"]
[null,null,null,"T5",500,"38 mm",5100,8700,200,"T5-500x38",38,"T5-500x38"]
[null,null,null,"T5",500,"50 mm",5100,9100,200,"T5-500x50",50,"T5-500x50"]
[null,null,null,"T5",500,"63 mm",5100,8800,200,"T5-500x63",63,"T5-500x63"]
[null,null,null,"T5",500,"80 mm",5100,9200,200,"T5-500x80",80,"T5-500x80"]
[null,null,null,"T5",1000,"10 mm",9800,13300,200,"T5-1000x10",10,"T5-1000x10"]
[null,null,null,"T5",1000,"15 mm",9800,14400,200,"T5-1000x15",15,"T5-1000x15"]
[null,null,null,"T5",1000,"25 mm",9800,16100,200,"T5-1000x25",25,"T5-1000x25"]
[null,null,null,"T5",1000,"38 mm",9800,16900,200,"T5-1000x38",38,"T5-1000x38"]
[null,null,null,"T5",1000,"50 mm",9800,17700,200,"T5-1000x50",50,"T5-1000x50"]
[null,null,null,"T5",1000,"63 mm",9800,16500,200,"T5-1000x63",63,"T5-1000x63"]
[null,null,null,"T5",1000,"80 mm",9800,17300,200,"T5-1000x80",80,"T5-1000x80"]
[null,null,null,"T5",1900,"10 mm",19200,26300,200,"T5-1900x10",10,"T5-1900x10"]
[null,null,null,"T5",1900,"15 mm",19200,31800,200,"T5-1900x15",15,"T5-1900x15"]
[null,null,null,"T5",1900,"25 mm",19200,30900,200,"T5-1900x25",25,"T5-1900x25"]
[null,null,null,"T5",1900,"38 mm",19200,31900,200,"T5-1900x38",38,"T5-1900x38"]
[null,null,null,"T5",1900,"50 mm",19200,33800,200,"T5-1900x50",50,"T5-1900x50"]
[null,null,null,"T5",1900,"63 mm",19200,34800,200,"T5-1900x63",63,"T5-1900x63"]
[null,null,null,"T5",1900,"80 mm",19200,35600,200,"T5-1900x80",80,"T5-1900x80"]
[null,null,null,"TNKT",1000,"13 mm",9630,16280,150,"TNKT-1000x13",13,{"$f":"J758","v":"TNKT-1000x13"}]
[null,null,null,"TNKT",1000,"16 mm",9630,16505,150,"TNKT-1000x16",16,"TNKT-1000x16"]
[null,null,null,"TNKT",1000,"19 mm",9630,16660,150,"TNKT-1000x19",19,"TNKT-1000x19"]
[null,null,null,"TNKT",1000,"25 mm",9630,16860,150,"TNKT-1000x25",25,"TNKT-1000x25"]
[null,null,null,"TNKT",1000,"32 mm",9630,17015,150,"TNKT-1000x32",32,"TNKT-1000x32"]
[null,null,null,"TNKT",1000,"38 mm",9630,17080,150,"TNKT-1000x38",38,"TNKT-1000x38"]
[null,null,null,"TNKT",1000,"50 mm",9630,17215,150,"TNKT-1000x50",50,"TNKT-1000x50"]
[null,null,null,"TNKT",1000,"63 mm",9630,17280,150,"TNKT-1000x63",63,"TNKT-1000x63"]
[null,null,null,"TNKT",1000,"75 mm",9630,17325,150,"TNKT-1000x75",75,"TNKT-1000x75"]
[null,null,null,"TNKT",1000,"80 mm",9630,17350,150,"TNKT-1000x80",80,"TNKT-1000x80"]
[null,null,null,"TNKT",1000,"100 mm",9630,17395,150,"TNKT-1000x100",100,"TNKT-1000x100"]
[null,null,null,"TNKT",1000,"125 mm",9630,17435,150,"TNKT-1000x125",125,"TNKT-1000x125"]
[null,null,null,"TNKT",1000,"150 mm",9630,17460,150,"TNKT-1000x150",150,"TNKT-1000x150"]
[null,null,null,"TNKT",1000,"175 mm",9630,17480,150,"TNKT-1000x175",175,"TNKT-1000x175"]
[null,null,null,"TNKT",1000,"200 mm",9630,17505,150,"TNKT-1000x200",200,"TNKT-1000x200"]
[null,null,null,"TNKT",2400,"16 mm",23300,37120,150,"TNKT-2400x16",16,"TNKT-2400x16"]
[null,null,null,"TNKT",2400,"19 mm",23300,37655,150,"TNKT-2400x19",19,"TNKT-2400x19"]
[null,null,null,"TNKT",2400,"25 mm",23300,38410,150,"TNKT-2400x25",25,"TNKT-2400x25"]
[null,null,null,"TNKT",2400,"32 mm",23300,38990,150,"TNKT-2400x32",32,"TNKT-2400x32"]
[null,null,null,"TNKT",2400,"38 mm",23300,39345,150,"TNKT-2400x38",38,"TNKT-2400x38"]
[null,null,null,"TNKT",2400,"50 mm",23300,39810,150,"TNKT-2400x50",50,"TNKT-2400x50"]
[null,null,null,"TNKT",2400,"63 mm",23300,40125,150,"TNKT-2400x63",63,"TNKT-2400x63"]
[null,null,null,"TNKT",2400,"75 mm",23300,40325,150,"TNKT-2400x75",75,{"$f":"J780","v":"TNKT-2400x75"}]
[null,null,null,"TNKT",2400,"80 mm",23300,40390,150,"TNKT-2400x80",80,"TNKT-2400x80"]
[null,null,null,"TNKT",2400,"100 mm",23300,40590,150,"TNKT-2400x100",100,"TNKT-2400x100"]
[null,null,null,"TNKT",2400,"125 mm",23300,40770,150,"TNKT-2400x125",125,"TNKT-2400x125"]
[null,null,null,"TNKT",2400,"150 mm",23300,40880,150,"TNKT-2400x150",150,"TNKT-2400x150"]
[null,null,null,"TNKT",2400,"175 mm",23300,40970,150,"TNKT-2400x175",175,"TNKT-2400x175"]
[null,null,null,"TNKT",2400,"200 mm",23300,41035,150,"TNKT-2400x200",200,"TNKT-2400x200"]
[null,null,null,"TNKT",4200,"16 mm",42900,68545,150,"TNKT-4200x16",16,"TNKT-4200x16"]
[null,null,null,"TNKT",4200,"19 mm",42900,69705,150,"TNKT-4200x19",19,"TNKT-4200x19"]
[null,null,null,"TNKT",4200,"25 mm",42900,71370,150,"TNKT-4200x25",25,"TNKT-4200x25"]
[null,null,null,"TNKT",4200,"32 mm",42900,72640,150,"TNKT-4200x32",32,"TNKT-4200x32"]
[null,null,null,"TNKT",4200,"38 mm",42900,73395,150,"TNKT-4200x38",38,"TNKT-4200x38"]
[null,null,null,"TNKT",4200,"50 mm",42900,74440,150,"TNKT-4200x50",50,"TNKT-4200x50"]
[null,null,null,"TNKT",4200,"63 mm",42900,75155,150,"TNKT-4200x63",63,"TNKT-4200x63"]
[null,null,null,"TNKT",4200,"75 mm",42900,75620,150,"TNKT-4200x75",75,"TNKT-4200x75"]
[null,null,null,"TNKT",4200,"80 mm",42900,75775,150,"TNKT-4200x80",80,"TNKT-4200x80"]
[null,null,null,"TNKT",4200,"100 mm",42900,76245,150,"TNKT-4200x100",100,"TNKT-4200x100"]
[null,null,null,"TNKT",4200,"125 mm",42900,76620,150,"TNKT-4200x125",125,"TNKT-4200x125"]
[null,null,null,"TNKT",4200,"150 mm",42900,76890,150,"TNKT-4200x150",150,"TNKT-4200x150"]
[null,null,null,"TNKT",4200,"175 mm",42900,77090,150,"TNKT-4200x175",175,"TNKT-4200x175"]
[null,null,null,"TNKT",4200,"200 mm",42900,77220,150,"TNKT-4200x200",200,"TNKT-4200x200"]
[null,null,null,"TNKT",4200,"225 mm",42900,77330,150,"TNKT-4200x225",225,"TNKT-4200x225"]
[null,null,null,"TNKT",6600,"16 mm",68435,99285,150,"TNKT-6600x16",16,"TNKT-6600x16"]
[null,null,null,"TNKT",6600,"19 mm",68435,101910,150,"TNKT-6600x19",19,"TNKT-6600x19"]
[null,null,null,"TNKT",6600,"25 mm",68435,10600,150,"TNKT-6600x25",25,"TNKT-6600x25"]
[null,null,null,"TNKT",6600,"32 mm",68435,109495,150,"TNKT-6600x32",32,"TNKT-6600x32"]
[null,null,null,"TNKT",6600,"38 mm",68435,111740,150,"TNKT-6600x38",38,"TNKT-6600x38"]
[null,null,null,"TNKT",6600,"50 mm",68435,115030,150,"TNKT-6600x50",50,"TNKT-6600x50"]
[null,null,null,"TNKT",6600,"63 mm",68435,117455,150,"TNKT-6600x63",63,"TNKT-6600x63"]
[null,null,null,"TNKT",6600,"75 mm",68435,119080,150,"TNKT-6600x75",75,"TNKT-6600x75"]
[null,null,null,"TNKT",6600,"80 mm",68435,119635,150,"TNKT-6600x80",80,"TNKT-6600x80"]
[null,null,null,"TNKT",6600,"100 mm",68435,121370,150,"TNKT-6600x100",100,"TNKT-6600x100"]
[null,null,null,"TNKT",6600,"125 mm",68435,122860,150,"TNKT-6600x125",125,"TNKT-6600x125"]
[null,null,null,"TNKT",6600,"150 mm",68435,123905,150,"TNKT-6600x150",150,"TNKT-6600x150"]
[null,null,null,"TNKT",6600,"175 mm",68435,124660,150,"TNKT-6600x175",175,"TNKT-6600x175"]
[null,null,null,"TNKT",6600,"200 mm",68435,125260,150,"TNKT-6600x200",200,"TNKT-6600x200"]
[null,null,null,"TNKT",6600,"225 mm",68435,125705,150,"TNKT-6600x225",225,"TNKT-6600x225"]
[null,null,null,"TNKS",1000,"13 mm",9630,16280,150,"TNKS-1000x13",13,"TNKS-1000x13"]
[null,null,null,"TNKS",1000,"16 mm",9630,16505,150,"TNKS-1000x16",16,"TNKS-1000x16"]
[null,null,null,"TNKS",1000,"19 mm",9630,16660,150,"TNKS-1000x19",19,"TNKS-1000x19"]
[null,null,null,"TNKS",1000,"25 mm",9630,16860,150,"TNKS-1000x25",25,"TNKS-1000x25"]
[null,null,null,"TNKS",1000,"32 mm",9630,17015,150,"TNKS-1000x32",32,"TNKS-1000x32"]
[null,null,null,"TNKS",1000,"38 mm",9630,17080,150,"TNKS-1000x38",38,"TNKS-1000x38"]
[null,null,null,"TNKS",1000,"50 mm",9630,17215,150,"TNKS-1000x50",50,"TNKS-1000x50"]
[null,null,null,"TNKS",1000,"63 mm",9630,17280,150,"TNKS-1000x63",63,"TNKS-1000x63"]
[null,null,null,"TNKS",1000,"75 mm",9630,17325,150,"TNKS-1000x75",75,"TNKS-1000x75"]
[null,null,null,"TNKS",1000,"80 mm",9630,17350,150,"TNKS-1000x80",80,"TNKS-1000x80"]
[null,null,null,"TNKS",1000,"100 mm",9630,17395,150,"TNKS-1000x100",100,"TNKS-1000x100"]
[null,null,null,"TNKS",1000,"125 mm",9630,17435,150,"TNKS-1000x125",125,"TNKS-1000x125"]
[null,null,null,"TNKS",1000,"150 mm",9630,17460,150,"TNKS-1000x150",150,"TNKS-1000x150"]
[null,null,null,"TNKS",1000,"175 mm",9630,17480,150,"TNKS-1000x175",175,"TNKS-1000x175"]
[null,null,null,"TNKS",1000,"200 mm",9630,17505,150,"TNKS-1000x200",200,"TNKS-1000x200"]
[null,null,null,"TNKS",2400,"16 mm",23300,37120,150,"TNKS-2400x16",16,"TNKS-2400x16"]
[null,null,null,"TNKS",2400,"19 mm",23300,37655,150,"TNKS-2400x19",19,"TNKS-2400x19"]
[null,null,null,"TNKS",2400,"25 mm",23300,38410,150,"TNKS-2400x25",25,"TNKS-2400x25"]
[null,null,null,"TNKS",2400,"32 mm",23300,38990,150,"TNKS-2400x32",32,"TNKS-2400x32"]
[null,null,null,"TNKS",2400,"38 mm",23300,39345,150,"TNKS-2400x38",38,"TNKS-2400x38"]
[null,null,null,"TNKS",2400,"50 mm",23300,39810,150,"TNKS-2400x50",50,"TNKS-2400x50"]
[null,null,null,"TNKS",2400,"63 mm",23300,40125,150,"TNKS-2400x63",63,"TNKS-2400x63"]
[null,null,null,"TNKS",2400,"75 mm",23300,40325,150,"TNKS-2400x75",75,"TNKS-2400x75"]
[null,null,null,"TNKS",2400,"80 mm",23300,40390,150,"TNKS-2400x80",80,"TNKS-2400x80"]
[null,null,null,"TNKS",2400,"100 mm",23300,40590,150,"TNKS-2400x100",100,"TNKS-2400x100"]
[null,null,null,"TNKS",2400,"125 mm",23300,40770,150,"TNKS-2400x125",125,"TNKS-2400x125"]
[null,null,null,"TNKS",2400,"150 mm",23300,40880,150,"TNKS-2400x150",150,"TNKS-2400x150"]
[null,null,null,"TNKS",2400,"175 mm",23300,40970,150,"TNKS-2400x175",175,{"$f":"J844","v":"TNKS-2400x175"}]
[null,null,null,"TNKS",2400,"200 mm",23300,41035,150,"TNKS-2400x200",200,"TNKS-2400x200"]
[null,null,null,"TNKS",4200,"16 mm",42900,68545,150,"TNKS-4200x16",16,"TNKS-4200x16"]
[null,null,null,"TNKS",4200,"19 mm",42900,69705,150,"TNKS-4200x19",19,"TNKS-4200x19"]
[null,null,null,"TNKS",4200,"25 mm",42900,71370,150,"TNKS-4200x25",25,"TNKS-4200x25"]
[null,null,null,"TNKS",4200,"32 mm",42900,72640,150,"TNKS-4200x32",32,"TNKS-4200x32"]
[null,null,null,"TNKS",4200,"38 mm",42900,73395,150,"TNKS-4200x38",38,"TNKS-4200x38"]
[null,null,null,"TNKS",4200,"50 mm",42900,74440,150,"TNKS-4200x50",50,"TNKS-4200x50"]
[null,null,null,"TNKS",4200,"63 mm",42900,75155,150,"TNKS-4200x63",63,"TNKS-4200x63"]
[null,null,null,"TNKS",4200,"75 mm",42900,75620,150,"TNKS-4200x75",75,"TNKS-4200x75"]
[null,null,null,"TNKS",4200,"80 mm",42900,75775,150,"TNKS-4200x80",80,"TNKS-4200x80"]
[null,null,null,"TNKS",4200,"100 mm",42900,76245,150,"TNKS-4200x100",100,"TNKS-4200x100"]
[null,null,null,"TNKS",4200,"125 mm",42900,76620,150,"TNKS-4200x125",125,"TNKS-4200x125"]
[null,null,null,"TNKS",4200,"150 mm",42900,76890,150,"TNKS-4200x150",150,"TNKS-4200x150"]
[null,null,null,"TNKS",4200,"175 mm",42900,77090,150,"TNKS-4200x175",175,"TNKS-4200x175"]
[null,null,null,"TNKS",4200,"200 mm",42900,77220,150,"TNKS-4200x200",200,"TNKS-4200x200"]
[null,null,null,"TNKS",4200,"225 mm",42900,77330,150,"TNKS-4200x225",225,"TNKS-4200x225"]
[null,null,null,"TNKS",6600,"16 mm",68435,99285,150,"TNKS-6600x16",16,"TNKS-6600x16"]
[null,null,null,"TNKS",6600,"19 mm",68435,101910,150,"TNKS-6600x19",19,"TNKS-6600x19"]
[null,null,null,"TNKS",6600,"25 mm",68435,10600,150,"TNKS-6600x25",25,"TNKS-6600x25"]
[null,null,null,"TNKS",6600,"32 mm",68435,109495,150,"TNKS-6600x32",32,"TNKS-6600x32"]
[null,null,null,"TNKS",6600,"38 mm",68435,111740,150,"TNKS-6600x38",38,"TNKS-6600x38"]
[null,null,null,"TNKS",6600,"50 mm",68435,115030,150,"TNKS-6600x50",50,"TNKS-6600x50"]
[null,null,null,"TNKS",6600,"63 mm",68435,117455,150,"TNKS-6600x63",63,"TNKS-6600x63"]
[null,null,null,"TNKS",6600,"75 mm",68435,119080,150,"TNKS-6600x75",75,"TNKS-6600x75"]
[null,null,null,"TNKS",6600,"80 mm",68435,119635,150,"TNKS-6600x80",80,"TNKS-6600x80"]
[null,null,null,"TNKS",6600,"100 mm",68435,121370,150,"TNKS-6600x100",100,"TNKS-6600x100"]
[null,null,null,"TNKS",6600,"125 mm",68435,122860,150,"TNKS-6600x125",125,"TNKS-6600x125"]
[null,null,null,"TNKS",6600,"150 mm",68435,123905,150,"TNKS-6600x150",150,"TNKS-6600x150"]
[null,null,null,"TNKS",6600,"175 mm",68435,124660,150,"TNKS-6600x175",175,"TNKS-6600x175"]
[null,null,null,"TNKS",6600,"200 mm",68435,125260,150,"TNKS-6600x200",200,"TNKS-6600x200"]
[null,null,null,"TNKS",6600,"225 mm",68435,125705,150,"TNKS-6600x225",225,"TNKS-6600x225"]
[null,null,null,"TNK",400,"0.25 in",3940,6655,150,"TNK-400x0.25",6.35,"TNK-400x0.25"]
[null,null,null,"TNK",400,"0.5 in",3940,6699,150,"TNK-400x0.5",12.7,"TNK-400x0.5"]
[null,null,null,"TNK",400,"0.75 in",3940,6708,150,"TNK-400x0.75",19.049999999999997,"TNK-400x0.75"]
[null,null,null,"TNK",400,"1 in",3940,6717,150,"TNK-400x1",25.4,"TNK-400x1"]
[null,null,null,"TNK",400,"1.5 in",3940,6726,150,"TNK-400x1.5",38.099999999999994,"TNK-400x1.5"]
[null,null,null,"TNK",400,"2 in",3940,6730,150,"TNK-400x2",50.8,"TNK-400x2"]
[null,null,null,"TNK",400,"2.5 in",3940,6730,150,"TNK-400x2.5",63.5,"TNK-400x2.5"]
[null,null,null,"TNK",400,"3 in",3940,6730,150,"TNK-400x3",76.199999999999989,"TNK-400x3"]
[null,null,null,"TNK","400 HS","0.25 in",3940,4391,150,"TNK-400x0.25 HS",6.35,"TNK-400x0.25 HS"]
[null,null,null,"TNK","400 HS","0.5 in",3940,4392,150,"TNK-400x0.5 HS",12.7,"TNK-400x0.5 HS"]
[null,null,null,"TNK","400 HS","0.75 in",3940,4392,150,"TNK-400x0.75 HS",19.049999999999997,"TNK-400x0.75 HS"]
[null,null,null,"TNK","400 HS","1 in",3940,4569,150,"TNK-400x1 HS",25.4,"TNK-400x1 HS"]
["Nya 20210902",null,null,"T2","750P","0.5 in",7300,12432,150,"T2-750Px0.5",12.7,"T2-750Px0.5"]
[null,null,null,"T2","750P","1 in",7300,12284,150,"T2-750Px1",25.4,"T2-750Px1"]
[null,null,null,"T2","750P","1.5 in",7300,12210,150,"T2-750Px1.5",38.1,"T2-750Px1.5"]
[null,null,null,"T2","750P","2 in",7300,12580,150,"T2-750Px2",50.8,"T2-750Px2"]
[null,null,null,"T2","750P","2.5 in",7300,12432,150,"T2-750Px2.5",63.5,"T2-750Px2.5"]
[null,null,null,"T2","750P","3 in",7300,12432,150,"T2-750Px3",76.2,"T2-750Px3"]
[null,null,null,"T2","750P","3.5 in",7300,12358,150,"T2-750Px3.5",88.9,"T2-750Px3.5"]
[null,null,null,"T2","750P","4 in",7300,12358,150,"T2-750Px4",101.6,"T2-750Px4"]
[null,null,null,"T2","750P","4.5 in",7300,12284,150,"T2-750Px4.5",114.3,"T2-750Px4.5"]
[null,null,null,"T2","750P","5 in",7300,12284,150,"T2-750Px5",127,"T2-750Px5"]
[null,null,null,"T2","750P","5.5 in",7300,12284,150,"T2-750Px5.5",139.69999999999999,"T2-750Px5.5"]
[null,null,null,"T2","750P","6 in",7300,12284,150,"T2-750Px6",152.4,"T2-750Px6"]
[null,null,null,"T2","750P","6.5 in",7300,12284,150,"T2-750Px6.5",165.1,"T2-750Px6.5"]
[null,null,null,"T2","750P","7 in",7300,12284,150,"T2-750Px7",177.8,"T2-750Px7"]
[null,null,null,"T2","750P","7.5 in",7300,12210,150,"T2-750Px7.5",190.5,"T2-750Px7.5"]
[null,null,null,"T2","750P","8 in",7300,12210,150,"T2-750Px8",203.2,"T2-750Px8"]
[null,null,null,"T2","750P","10 in",7300,12210,150,"T2-750Px10",254,"T2-750Px10"]
[null,null,null,"T2","750P","25 mm",7300,12284,150,"T2-750Px25",25,"T2-750Px25"]
[null,null,null,"T2","750P","50 mm",7300,12580,150,"T2-750Px50",50,"T2-750Px50"]
[null,null,null,"T2","750P","75 mm",7300,12432,150,"T2-750Px75",75,"T2-750Px75"]
[null,null,null,"T2","750P","80 mm",7300,12358,150,"T2-750Px80",80,"T2-750Px80"]
[null,null,null,"T2","750P","100 mm",7300,12358,150,"T2-750Px100",100,"T2-750Px100"]
[null,null,null,"T2","750P","125 mm",7300,12284,150,"T2-750Px125",125,"T2-750Px125"]
[null,null,null,"T2","750P","150 mm",7300,12284,150,"T2-750Px150",150,"T2-750Px150"]
[null,null,null,"T2","750P","160 mm",7300,12284,150,"T2-750Px160",160,"T2-750Px160"]
[null,null,null,"T2","750P","175 mm",7300,12284,150,"T2-750Px175",175,"T2-750Px175"]
[null,null,null,"T2","750P","200 mm",7300,12210,150,"T2-750Px200",200,"T2-750Px200"]
[null,null,null,"T2","750P","250 mm",7300,12210,150,"T2-750Px250",250,"T2-750Px250"]
[null,null,null,"T2B",1500,"0.5 in",15300,22338,150,"T2B-1500x0.5",12.7,"T2B-1500x0.5"]
[null,null,null,"T2B",1500,"1 in",15300,22491,150,"T2B-1500x1",25.4,"T2B-1500x1"]
[null,null,null,"T2B",1500,"1.5 in",15300,22491,150,"T2B-1500x1.5",38.1,"T2B-1500x1.5"]
[null,null,null,"T2B",1500,"2 in",15300,22644,150,"T2B-1500x2",50.8,"T2B-1500x2"]
[null,null,null,"T2B",1500,"2.5 in",15300,22644,150,"T2B-1500x2.5",63.5,"T2B-1500x2.5"]
[null,null,null,"T2B",1500,"3 in",15300,22644,150,"T2B-1500x3",76.2,"T2B-1500x3"]
[null,null,null,"T2B",1500,"3.5 in",15300,22644,150,"T2B-1500x3.5",88.9,"T2B-1500x3.5"]
[null,null,null,"T2B",1500,"4 in",15300,23256,150,"T2B-1500x4",101.6,"T2B-1500x4"]
[null,null,null,"T2B",1500,"4.5 in",15300,23103,150,"T2B-1500x4.5",114.3,"T2B-1500x4.5"]
[null,null,null,"T2B",1500,"5 in",15300,23103,150,"T2B-1500x5",127,"T2B-1500x5"]
[null,null,null,"T2B",1500,"5.5 in",15300,23103,150,"T2B-1500x5.5",139.69999999999999,"T2B-1500x5.5"]
[null,null,null,"T2B",1500,"6 in",15300,23103,150,"T2B-1500x6",152.4,"T2B-1500x6"]
[null,null,null,"T2B",1500,"6.5 in",15300,22950,150,"T2B-1500x6.5",165.1,"T2B-1500x6.5"]
[null,null,null,"T2B",1500,"7 in",15300,22950,150,"T2B-1500x7",177.8,"T2B-1500x7"]
[null,null,null,"T2B",1500,"7.5 in",15300,22950,150,"T2B-1500x7.5",190.5,"T2B-1500x7.5"]
[null,null,null,"T2B",1500,"8 in",15300,22950,150,"T2B-1500x8",203.2,"T2B-1500x8"]
[null,null,null,"T2B",1500,"9 in",15300,22950,150,"T2B-1500x9",228.6,"T2B-1500x9"]
[null,null,null,"T2B",1500,"10 in",15300,22950,150,"T2B-1500x10",254,"T2B-1500x10"]
[null,null,null,"T2B",1500,"10.5 in",15300,22950,150,"T2B-1500x10.5",266.7,"T2B-1500x10.5"]
[null,null,null,"T2B",1500,"12 in",15300,22950,150,"T2B-1500x12",304.8,"T2B-1500x12"]
[null,null,null,"T2B",1500,"25 mm",15300,22491,150,"T2B-1500x25",25,"T2B-1500x25"]
[null,null,null,"T2B",1500,"50 mm",15300,22644,150,"T2B-1500x50",50,"T2B-1500x50"]
[null,null,null,"T2B",1500,"75 mm",15300,22644,150,"T2B-1500x75",75,"T2B-1500x75"]
[null,null,null,"T2B",1500,"80 mm",15300,22644,150,"T2B-1500x80",80,"T2B-1500x80"]
[null,null,null,"T2B",1500,"100 mm",15300,23256,150,"T2B-1500x100",100,"T2B-1500x100"]
[null,null,null,"T2B",1500,"125 mm",15300,23103,150,"T2B-1500x125",125,"T2B-1500x125"]
[null,null,null,"T2B",1500,"150 mm",15300,23103,150,"T2B-1500x150",150,"T2B-1500x150"]
[null,null,null,"T2B",1500,"160 mm",15300,22950,150,"T2B-1500x160",160,"T2B-1500x160"]
[null,null,null,"T2B",1500,"175 mm",15300,22950,150,"T2B-1500x175",175,"T2B-1500x175"]
[null,null,null,"T2B",1500,"200 mm",15300,22950,150,"T2B-1500x200",200,"T2B-1500x200"]
[null,null,null,"T2B",3000,"0.5 in",29500,45135,150,"T2B-3000x0.5",12.7,"T2B-3000x0.5"]
[null,null,null,"T2B",3000,"1 in",29500,46610,150,"T2B-3000x1",25.4,"T2B-3000x1"]
[null,null,null,"T2B",3000,"1.5 in",29500,46610,150,"T2B-3000x1.5",38.1,"T2B-3000x1.5"]
[null,null,null,"T2B",3000,"2 in",29500,46610,150,"T2B-3000x2",50.8,"T2B-3000x2"]
[null,null,null,"T2B",3000,"2.5 in",29500,46610,150,"T2B-3000x2.5",63.5,"T2B-3000x2.5"]
[null,null,null,"T2B",3000,"3 in",29500,46610,150,"T2B-3000x3",76.2,"T2B-3000x3"]
[null,null,null,"T2B",3000,"3.5 in",29500,46610,150,"T2B-3000x3.5",88.9,"T2B-3000x3.5"]
[null,null,null,"T2B",3000,"4 in",29500,47200,150,"T2B-3000x4",101.6,"T2B-3000x4"]
[null,null,null,"T2B",3000,"4.5 in",29500,47200,150,"T2B-3000x4.5",114.3,"T2B-3000x4.5"]
[null,null,null,"T2B",3000,"5 in",29500,47200,150,"T2B-3000x5",127,"T2B-3000x5"]
[null,null,null,"T2B",3000,"5.5 in",29500,46905,150,"T2B-3000x5.5",139.69999999999999,"T2B-3000x5.5"]
[null,null,null,"T2B",3000,"6 in",29500,46905,150,"T2B-3000x6",152.4,"T2B-3000x6"]
[null,null,null,"T2B",3000,"6.5 in",29500,46905,150,"T2B-3000x6.5",165.1,"T2B-3000x6.5"]
[null,null,null,"T2B",3000,"7 in",29500,46905,150,"T2B-3000x7",177.8,"T2B-3000x7"]
[null,null,null,"T2B",3000,"7.5 in",29500,46905,150,"T2B-3000x7.5",190.5,"T2B-3000x7.5"]
[null,null,null,"T2B",3000,"8 in",29500,46905,150,"T2B-3000x8",203.2,"T2B-3000x8"]
[null,null,null,"T2B",3000,"8.5 in",29500,46905,150,"T2B-3000x8.5",215.9,"T2B-3000x8.5"]
[null,null,null,"T2B",3000,"9 in",29500,46905,150,"T2B-3000x9",228.6,"T2B-3000x9"]
[null,null,null,"T2B",3000,"10 in",29500,47200,150,"T2B-3000x10",254,"T2B-3000x10"]
[null,null,null,"T2B",3000,"12 in",29500,47200,150,"T2B-3000x12",304.8,"T2B-3000x12"]
[null,null,null,"T2B",3000,"25 mm",29500,46610,150,"T2B-3000x25",25,"T2B-3000x25"]
[null,null,null,"T2B",3000,"50 mm",29500,46610,150,"T2B-3000x50",50,"T2B-3000x50"]
[null,null,null,"T2B",3000,"75 mm",29500,46610,150,"T2B-3000x75",75,"T2B-3000x75"]
[null,null,null,"T2B",3000,"80 mm",29500,46610,150,"T2B-3000x80",80,"T2B-3000x80"]
[null,null,null,"T2B",3000,"100 mm",29500,47200,150,"T2B-3000x100",100,"T2B-3000x100"]
[null,null,null,"T2B",3000,"125 mm",29500,47200,150,"T2B-3000x125",125,"T2B-3000x125"]
[null,null,null,"T2B",3000,"150 mm",29500,46905,150,"T2B-3000x150",150,"T2B-3000x150"]
[null,null,null,"T2B",3000,"160 mm",29500,46905,150,"T2B-3000x160",160,"T2B-3000x160"]
[null,null,null,"T2B",3000,"175 mm",29500,46905,150,"T2B-3000x175",175,"T2B-3000x175"]
[null,null,null,"T2B",3000,"200 mm",29500,46905,150,"T2B-3000x200",200,"T2B-3000x200"]
[null,null,null,"T2B",5000,"0.5 in",49800,81672,150,"T2B-5000x0.5",12.7,"T2B-5000x0.5"]
[null,null,null,"T2B",5000,"1 in",49800,81174,150,"T2B-5000x1",25.4,"T2B-5000x1"]
[null,null,null,"T2B",5000,"1.5 in",49800,81174,150,"T2B-5000x1.5",38.1,"T2B-5000x1.5"]
[null,null,null,"T2B",5000,"2 in",49800,81174,150,"T2B-5000x2",50.8,"T2B-5000x2"]
[null,null,null,"T2B",5000,"2.5 in",49800,81174,150,"T2B-5000x2.5",63.5,"T2B-5000x2.5"]
[null,null,null,"T2B",5000,"3 in",49800,82668,150,"T2B-5000x3",76.2,"T2B-5000x3"]
[null,null,null,"T2B",5000,"3.5 in",49800,82668,150,"T2B-5000x3.5",88.9,"T2B-5000x3.5"]
[null,null,null,"T2B",5000,"4 in",49800,82668,150,"T2B-5000x4",101.6,"T2B-5000x4"]
[null,null,null,"T2B",5000,"4.5 in",49800,82170,150,"T2B-5000x4.5",114.3,"T2B-5000x4.5"]
[null,null,null,"T2B",5000,"5 in",49800,82170,150,"T2B-5000x5",127,"T2B-5000x5"]
[null,null,null,"T2B",5000,"5.5 in",49800,82170,150,"T2B-5000x5.5",139.69999999999999,"T2B-5000x5.5"]
[null,null,null,"T2B",5000,"6.5 in",49800,82170,150,"T2B-5000x6.5",165.1,"T2B-5000x6.5"]
[null,null,null,"T2B",5000,"7 in",49800,82170,150,"T2B-5000x7",177.8,"T2B-5000x7"]
[null,null,null,"T2B",5000,"7.5 in",49800,81672,150,"T2B-5000x7.5",190.5,"T2B-5000x7.5"]
[null,null,null,"T2B",5000,"8 in",49800,81672,150,"T2B-5000x8",203.2,"T2B-5000x8"]
[null,null,null,"T2B",5000,"8.5 in",49800,81672,150,"T2B-5000x8.5",215.9,"T2B-5000x8.5"]
[null,null,null,"T2B",5000,"9 in",49800,81672,150,"T2B-5000x9",228.6,"T2B-5000x9"]
[null,null,null,"T2B",5000,"10 in",49800,82668,150,"T2B-5000x10",254,"T2B-5000x10"]
[null,null,null,"T2B",5000,"25 mm",49800,81174,150,"T2B-5000x25",25,"T2B-5000x25"]
[null,null,null,"T2B",5000,"50 mm",49800,81174,150,"T2B-5000x50",50,"T2B-5000x50"]
[null,null,null,"T2B",5000,"75 mm",49800,82668,150,"T2B-5000x75",75,"T2B-5000x75"]
[null,null,null,"T2B",5000,"80 mm",49800,82668,150,"T2B-5000x80",80,"T2B-5000x80"]
[null,null,null,"T2B",5000,"100 mm",49800,82668,150,"T2B-5000x100",100,"T2B-5000x100"]
[null,null,null,"T2B",5000,"125 mm",49800,82170,150,"T2B-5000x125",125,"T2B-5000x125"]
[null,null,null,"T2B",5000,"150 mm",49800,82170,150,"T2B-5000x150",150,"T2B-5000x150"]
[null,null,null,"T2B",5000,"160 mm",49800,82170,150,"T2B-5000x160",160,"T2B-5000x160"]
[null,null,null,"T2B",5000,"175 mm",49800,82170,150,"T2B-5000x175",175,"T2B-5000x175"]
[null,null,null,"T2B",5000,"200 mm",49800,81672,150,"T2B-5000x200",200,"T2B-5000x200"]
[]
[]
[]
[]
[]
[]
[null,null,null,"Removed Items:"]
[null,null,null,"TNKB",1000,"16 mm",9630,16505,150,"TNKB-1000x16",16,{"$f":"J1011","v":"TNKB-1000x16"}]
[null,null,null,"TNKB",1000,"25 mm",9630,16860,150,"TNKB-1000x25",25,"TNKB-1000x25"]
[null,null,null,"TNKB",1000,"38 mm",9630,17080,150,"TNKB-1000x38",38,"TNKB-1000x38"]
[null,null,null,"TNKB",1000,"50 mm",9630,17215,150,"TNKB-1000x50",50,"TNKB-1000x50"]
[null,null,null,"TNKB",1000,"63 mm",9630,17280,150,"TNKB-1000x63",63,"TNKB-1000x63"]
[null,null,null,"TNKB",1000,"75 mm",9630,17325,150,"TNKB-1000x75",75,"TNKB-1000x75"]
[null,null,null,"TNKB",1000,"88 mm",9630,15510,150,"TNKB-1000x88",88,"TNKB-1000x88"]
[null,null,null,"TNKB",1000,"100 mm",9630,17395,150,"TNKB-1000x100",100,"TNKB-1000x100"]
[null,null,null,"TNKB",1000,"113 mm",9630,16525,150,"TNKB-1000x113",113,"TNKB-1000x113"]
[null,null,null,"TNKB",1000,"125 mm",9630,17435,150,"TNKB-1000x125",125,"TNKB-1000x125"]
[null,null,null,"TNKB",1000,"138 mm",9630,16710,150,"TNKB-1000x138",138,"TNKB-1000x138"]
[null,null,null,"TNKB",1000,"150 mm",9630,17460,150,"TNKB-1000x150",150,"TNKB-1000x150"]
[null,null,null,"TNKB",2400,"16 mm",23300,37120,150,"TNKB-2400x16",16,"TNKB-2400x16"]
[null,null,null,"TNKB",2400,"25 mm",23300,38410,150,"TNKB-2400x25",25,"TNKB-2400x25"]
[null,null,null,"TNKB",2400,"38 mm",23300,39345,150,"TNKB-2400x38",38,"TNKB-2400x38"]
[null,null,null,"TNKB",2400,"50 mm",23300,39810,150,"TNKB-2400x50",50,"TNKB-2400x50"]
[null,null,null,"TNKB",2400,"63 mm",23300,40125,150,"TNKB-2400x63",63,"TNKB-2400x63"]
[null,null,null,"TNKB",2400,"75 mm",23300,40325,150,"TNKB-2400x75",75,"TNKB-2400x75"]
[null,null,null,"TNKB",2400,"88 mm",23300,36710,150,"TNKB-2400x88",88,"TNKB-2400x88"]
[null,null,null,"TNKB",2400,"100 mm",23300,40590,150,"TNKB-2400x100",100,"TNKB-2400x100"]
[null,null,null,"TNKB",2400,"113 mm",23300,38860,150,"TNKB-2400x113",113,"TNKB-2400x113"]
[null,null,null,"TNKB",2400,"125 mm",23300,40770,150,"TNKB-2400x125",125,"TNKB-2400x125"]
[null,null,null,"TNKB",2400,"138 mm",23300,39310,150,"TNKB-2400x138",138,"TNKB-2400x138"]
[null,null,null,"TNKB",2400,"150 mm",23300,40880,150,"TNKB-2400x150",150,"TNKB-2400x150"]
[null,null,null,"TNKB",4200,"16 mm",42900,68545,150,"TNKB-4200x16",16,"TNKB-4200x16"]
[null,null,null,"TNKB",4200,"25 mm",42900,71370,150,"TNKB-4200x25",25,"TNKB-4200x25"]
[null,null,null,"TNKB",4200,"38 mm",42900,73395,150,"TNKB-4200x38",38,"TNKB-4200x38"]
[null,null,null,"TNKB",4200,"50 mm",42900,74440,150,"TNKB-4200x50",50,"TNKB-4200x50"]
[null,null,null,"TNKB",4200,"63 mm",42900,75155,150,"TNKB-4200x63",63,"TNKB-4200x63"]
[null,null,null,"TNKB",4200,"75 mm",42900,75620,150,"TNKB-4200x75",75,"TNKB-4200x75"]
[null,null,null,"TNKB",4200,"88 mm",42900,68930,150,"TNKB-4200x88",88,"TNKB-4200x88"]
[null,null,null,"TNKB",4200,"100 mm",42900,76245,150,"TNKB-4200x100",100,"TNKB-4200x100"]
[null,null,null,"TNKB",4200,"113 mm",42900,73000,150,"TNKB-4200x113",113,"TNKB-4200x113"]
[null,null,null,"TNKB",4200,"125 mm",42900,76620,150,"TNKB-4200x125",125,"TNKB-4200x125"]
[null,null,null,"TNKB",4200,"138 mm",42900,73895,150,"TNKB-4200x138",138,"TNKB-4200x138"]
[null,null,null,"TNKB",4200,"150 mm",42900,76890,150,"TNKB-4200x150",150,"TNKB-4200x150"]
[null,null,null,"TNKB",4200,"163 mm",42900,74530,150,"TNKB-4200x163",163,"TNKB-4200x163"]
[null,null,null,"TNKB",4200,"175 mm",42900,77090,150,"TNKB-4200x175",175,"TNKB-4200x175"]
[null,null,null,"TNKB",6600,"16 mm",68435,99285,150,"TNKB-6600x16",16,"TNKB-6600x16"]
[null,null,null,"TNKB",6600,"25 mm",68435,106000,150,"TNKB-6600x25",25,"TNKB-6600x25"]
[null,null,null,"TNKB",6600,"38 mm",68435,11740,150,"TNKB-6600x38",38,"TNKB-6600x38"]
[null,null,null,"TNKB",6600,"50 mm",68435,115030,150,"TNKB-6600x50",50,"TNKB-6600x50"]
[null,null,null,"TNKB",6600,"63 mm",68435,117455,150,"TNKB-6600x63",63,"TNKB-6600x63"]
[null,null,null,"TNKB",6600,"75 mm",68435,119080,150,"TNKB-6600x75",75,"TNKB-6600x75"]
[null,null,null,"TNKB",6600,"88 mm",68435,113765,150,"TNKB-6600x88",88,"TNKB-6600x88"]
[null,null,null,"TNKB",6600,"100 mm",68435,121370,150,"TNKB-6600x100",100,"TNKB-6600x100"]
[null,null,null,"TNKB",6600,"113 mm",68435,116745,150,"TNKB-6600x113",113,"TNKB-6600x113"]
[null,null,null,"TNKB",6600,"125 mm",68435,122860,150,"TNKB-6600x125",125,"TNKB-6600x125"]
[null,null,null,"TNKB",6600,"138 mm",68435,118805,150,"TNKB-6600x138",138,"TNKB-6600x138"]
[null,null,null,"TNKB",6600,"150 mm",68435,123905,150,"TNKB-6600x150",150,"TNKB-6600x150"]
[null,null,null,"TNKB",6600,"163 mm",68435,120300,150,"TNKB-6600x163",163,"TNKB-6600x163"]
[null,null,null,"TNKB",6600,"175 mm",68435,124660,150,"TNKB-6600x175",175,"TNKB-6600x175"]
[null,null,null,"TNKB",6600,"188 mm",68435,121440,150,"TNKB-6600x188",188,"TNKB-6600x188"]
[null,null,null,"TNKB",6600,"200 mm",68435,125260,150,"TNKB-6600x200",200,"TNKB-6600x200"]

{"sheet":"Ford","index":2,"n_rows":131,"n_cols":12,"rows_kept":131,"cut":false,"hidden":false,"merged":[]}
[null,null,null,"Ford Series","Ford Size","Stroke","Init Force","Final Force","Max Pres","Hyson Reference","mm","Ford STRCode"]
[null,null,null,"WDX356015",7,"25 mm",106000,160000,150,"NP-750x25",25,"WDX356015-07-02-DMS"]
[null,null,null,"WDX356015",7,"38.1 mm",106000,160000,150,"NP-750x38.1",38.1,"WDX356015-07-03-DMS"]
[null,null,null,"WDX356015",7,"50 mm",106000,160000,150,"NP-750x50",50,"WDX356015-07-05-DMS"]
[null,null,null,"WDX356015",7,"63.5 mm",106000,160000,150,"NP-750x63.5",63.5,"WDX356015-07-06-DMS"]
[null,null,null,"WDX356015",7,"80 mm",106000,160000,150,"NP-750x80",80,"WDX356015-07-08-DMS"]
[null,null,null,"WDX356015",7,"100 mm",106000,160000,150,"NP-750x100",100,"WDX356015-07-10-DMS"]
[null,null,null,"WDX356015",7,"125 mm",106000,160000,150,"NP-750x125",125,"WDX356015-07-12-DMS"]
[null,null,null,"WDX356015",7,"160 mm",106000,160000,150,"NP-750x160",160,"WDX356015-07-16-DMS"]
[null,null,null,"WDX356015",7,"200 mm",106000,160000,150,"NP-750x200",200,"WDX356015-07-20-DMS"]
[null,null,null,"WDX356015",15,"25 mm",106000,160000,150,"NP-1500x25",25,"WDX356015-15-02-DMS"]
[null,null,null,"WDX356015",15,"38.1 mm",106000,160000,150,"NP-1500x38.1",38.1,"WDX356015-15-03-DMS"]
[null,null,null,"WDX356015",15,"50 mm",106000,160000,150,"NP-1500x50",50,"WDX356015-15-05-DMS"]
[null,null,null,"WDX356015",15,"63.5 mm",106000,160000,150,"NP-1500x63.5",63.5,"WDX356015-15-06-DMS"]
[null,null,null,"WDX356015",15,"80 mm",106000,160000,150,"NP-1500x80",80,"WDX356015-15-08-DMS"]
[null,null,null,"WDX356015",15,"100 mm",106000,160000,150,"NP-1500x100",100,"WDX356015-15-10-DMS"]
[null,null,null,"WDX356015",15,"125 mm",106000,160000,150,"NP-1500x125",125,"WDX356015-15-12-DMS"]
[null,null,null,"WDX356015",15,"160 mm",106000,160000,150,"NP-1500x160",160,"WDX356015-15-16-DMS"]
[null,null,null,"WDX356015",15,"200 mm",106000,160000,150,"NP-1500x200",200,"WDX356015-15-20-DMS"]
[null,null,null,"WDX356015",30,"25 mm",106000,160000,150,"NP-3000x25",25,"WDX356015-30-02-DMS"]
[null,null,null,"WDX356015",30,"38.1 mm",106000,160000,150,"NP-3000x38.1",38.1,"WDX356015-30-03-DMS"]
[null,null,null,"WDX356015",30,"50 mm",106000,160000,150,"NP-3000x50",50,"WDX356015-30-05-DMS"]
[null,null,null,"WDX356015",30,"63.5 mm",106000,160000,150,"NP-3000x63.5",63.5,"WDX356015-30-06-DMS"]
[null,null,null,"WDX356015",30,"80 mm",106000,160000,150,"NP-3000x80",80,"WDX356015-30-08-DMS"]
[null,null,null,"WDX356015",30,"100 mm",106000,160000,150,"NP-3000x100",100,"WDX356015-30-10-DMS"]
[null,null,null,"WDX356015",30,"125 mm",106000,160000,150,"NP-3000x125",125,"WDX356015-30-12-DMS"]
[null,null,null,"WDX356015",30,"160 mm",106000,160000,150,"NP-3000x160",160,"WDX356015-30-16-DMS"]
[null,null,null,"WDX356015",30,"200 mm",106000,160000,150,"NP-3000x200",200,"WDX356015-30-20-DMS"]
[null,null,null,"WDX356015",50,"25 mm",106000,160000,150,"NP-5000x25",25,"WDX356015-50-02-DMS"]
[null,null,null,"WDX356015",50,"38.1 mm",106000,160000,150,"NP-5000x38.1",38.1,"WDX356015-50-03-DMS"]
[null,null,null,"WDX356015",50,"50 mm",106000,160000,150,"NP-5000x50",50,"WDX356015-50-05-DMS"]
[null,null,null,"WDX356015",50,"63.5 mm",106000,160000,150,"NP-5000x63.5",63.5,"WDX356015-50-06-DMS"]
[null,null,null,"WDX356015",50,"80 mm",106000,160000,150,"NP-5000x80",80,"WDX356015-50-08-DMS"]
[null,null,null,"WDX356015",50,"100 mm",106000,160000,150,"NP-5000x100",100,"WDX356015-50-10-DMS"]
[null,null,null,"WDX356015",50,"125 mm",106000,160000,150,"NP-5000x125",125,"WDX356015-50-12-DMS"]
[null,null,null,"WDX356015",50,"160 mm",106000,160000,150,"NP-5000x160",160,"WDX356015-50-16-DMS"]
[null,null,null,"WDX356015",50,"200 mm",106000,160000,150,"NP-5000x200",200,"WDX356015-50-20-DMS"]
[null,null,null,"WDX356015",75,"25 mm",106000,160000,150,"NP-7500x25",25,"WDX356015-75-02-DMS"]
[null,null,null,"WDX356015",75,"38.1 mm",106000,160000,150,"NP-7500x38.1",38.1,"WDX356015-75-03-DMS"]
[null,null,null,"WDX356015",75,"50 mm",106000,160000,150,"NP-7500x50",50,"WDX356015-75-05-DMS"]
[null,null,null,"WDX356015",75,"63.5 mm",106000,160000,150,"NP-7500x63.5",63.5,"WDX356015-75-06-DMS"]
[null,null,null,"WDX356015",75,"80 mm",106000,160000,150,"NP-7500x80",80,"WDX356015-75-08-DMS"]
[null,null,null,"WDX356015",75,"100 mm",106000,160000,150,"NP-7500x100",100,"WDX356015-75-10-DMS"]
[null,null,null,"WDX356015",75,"125 mm",106000,160000,150,"NP-7500x125",125,"WDX356015-75-12-DMS"]
[null,null,null,"WDX356015",75,"160 mm",106000,160000,150,"NP-7500x160",160,"WDX356015-75-16-DMS"]
[null,null,null,"WDX356015",75,"200 mm",106000,160000,150,"NP-7500x200",200,"WDX356015-75-20-DMS"]
[null,null,null,"WDX356022",3,"50 mm",2000,3060,180,"T2L-300x50",50,"WDX356022-03-05-DMS"]
[null,null,null,"WDX356022",3,"2.50 in",2000,3060,180,"T2L-300x2.50",63.5,"WDX356022-03-06-DMS"]
[null,null,null,"WDX356025",30,"25 mm",106000,160000,150,"NPL-3000x25",25,"WDX356025-30-02-DMS"]
[null,null,null,"WDX356025",30,"37.5 mm",106000,160000,150,"NPL-3000x37.5",37.5,"WDX356025-30-03-DMS"]
[null,null,null,"WDX356025",30,"50 mm",106000,160000,150,"NPL-3000x50",50,"WDX356025-30-05-DMS"]
[null,null,null,"WDX356025",30,"62.5 mm",106000,160000,150,"NPL-3000x62.5",62.5,"WDX356025-30-06-DMS"]
[null,null,null,"WDX356025",30,"80 mm",106000,160000,150,"NPL-3000x80",80,"WDX356025-30-08-DMS"]
[null,null,null,"WDX356025",30,"100 mm",106000,160000,150,"NPL-3000x100",100,"WDX356025-30-10-DMS"]
[null,null,null,"WDX356025",30,"125 mm",106000,160000,150,"NPL-3000x125",125,"WDX356025-30-12-DMS"]
[null,null,null,"WDX356025",30,"160 mm",106000,160000,150,"NPL-3000x160",160,"WDX356025-30-16-DMS"]
[null,null,null,"WDX356025",30,"200 mm",106000,160000,150,"NPL-3000x200",200,"WDX356025-30-20-DMS"]
[null,null,null,"WDX356025",50,"25 mm",106000,160000,150,"NPL-5000x25",25,"WDX356025-50-02-DMS"]
[null,null,null,"WDX356025",50,"37.5 mm",106000,160000,150,"NPL-5000x37.5",37.5,"WDX356025-50-03-DMS"]
[null,null,null,"WDX356025",50,"50 mm",106000,160000,150,"NPL-5000x50",50,"WDX356025-50-05-DMS"]
[null,null,null,"WDX356025",50,"62.5 mm",106000,160000,150,"NPL-5000x62.5",62.5,"WDX356025-50-06-DMS"]
[null,null,null,"WDX356025",50,"80 mm",106000,160000,150,"NPL-5000x80",80,"WDX356025-50-08-DMS"]
[null,null,null,"WDX356025",50,"100 mm",106000,160000,150,"NPL-5000x100",100,"WDX356025-50-10-DMS"]
[null,null,null,"WDX356025",50,"125 mm",106000,160000,150,"NPL-5000x125",125,"WDX356025-50-12-DMS"]
[null,null,null,"WDX356025",50,"160 mm",106000,160000,150,"NPL-5000x160",160,"WDX356025-50-16-DMS"]
[null,null,null,"WDX356025",50,"200 mm",106000,160000,150,"NPL-5000x200",200,"WDX356025-50-20-DMS"]
[null,null,null,"WDX356025",75,"25 mm",106000,160000,150,"NPL-7500x25",25,"WDX356025-75-02-DMS"]
[null,null,null,"WDX356025",75,"37.5 mm",106000,160000,150,"NPL-7500x37.5",37.5,"WDX356025-75-03-DMS"]
[null,null,null,"WDX356025",75,"50 mm",106000,160000,150,"NPL-7500x50",50,"WDX356025-75-05-DMS"]
[null,null,null,"WDX356025",75,"62.5 mm",106000,160000,150,"NPL-7500x62.5",62.5,"WDX356025-75-06-DMS"]
[null,null,null,"WDX356025",75,"80 mm",106000,160000,150,"NPL-7500x80",80,"WDX356025-75-08-DMS"]
[null,null,null,"WDX356025",75,"100 mm",106000,160000,150,"NPL-7500x100",100,"WDX356025-75-10-DMS"]
[null,null,null,"WDX356025",75,"125 mm",106000,160000,150,"NPL-7500x125",125,"WDX356025-75-12-DMS"]
[null,null,null,"WDX356025",75,"160 mm",106000,160000,150,"NPL-7500x160",160,"WDX356025-75-16-DMS"]
[null,null,null,"WDX356025",75,"200 mm",106000,160000,150,"NPL-7500x200",200,"WDX356025-75-20-DMS"]
[null,null,null,"WDX356101",3,"25 mm",2000,3060,180,"T3-350x25",25,"WDX356101-03-02-DMS"]
[null,null,null,"WDX356101",3,"38 mm",2000,3060,180,"T3-350x38",38,"WDX356101-03-03-DMS"]
[null,null,null,"WDX356101",3,"50 mm",2000,3060,180,"T3-350x50",50,"WDX356101-03-05-DMS"]
[null,null,null,"WDX356101",3,"63 mm",2000,3060,180,"T3-350x63",63,"WDX356101-03-06-DMS"]
[null,null,null,"WDX356101",3,"80 mm",2000,3060,180,"T3-350x80",80,"WDX356101-03-08-DMS"]
[null,null,null,"WDX356101",3,"100 mm",2000,3060,180,"T3-350x100",100,"WDX356101-03-10-DMS"]
[null,null,null,"WDX356101",3,"125 mm",2000,3060,180,"T3-350x125",125,"WDX356101-03-12-DMS"]
[null,null,null,"WDX356101",7,"25 mm",2000,3060,180,"T3-500x25",25,"WDX356101-07-02-DMS"]
[null,null,null,"WDX356101",7,"38 mm",2000,3060,180,"T3-500x38",38,"WDX356101-07-03-DMS"]
[null,null,null,"WDX356101",7,"50 mm",2000,3060,180,"T3-500x50",50,"WDX356101-07-05-DMS"]
[null,null,null,"WDX356101",7,"63 mm",2000,3060,180,"T3-500x63",63,"WDX356101-07-06-DMS"]
[null,null,null,"WDX356101",7,"80 mm",2000,3060,180,"T3-500x80",80,"WDX356101-07-08-DMS"]
[null,null,null,"WDX356101",7,"100 mm",2000,3060,180,"T3-500x100",100,"WDX356101-07-10-DMS"]
[null,null,null,"WDX356101",7,"125 mm",2000,3060,180,"T3-500x125",125,"WDX356101-07-12-DMS"]
[null,null,null,"WDX356101",10,"25 mm",2000,3060,180,"T3-1000x25",25,"WDX356101-10-02-DMS"]
[null,null,null,"WDX356101",10,"38 mm",2000,3060,180,"T3-1000x38",38,"WDX356101-10-03-DMS"]
[null,null,null,"WDX356101",10,"50 mm",2000,3060,180,"T3-1000x50",50,"WDX356101-10-05-DMS"]
[null,null,null,"WDX356101",10,"63 mm",2000,3060,180,"T3-1000x63",63,"WDX356101-10-06-DMS"]
[null,null,null,"WDX356101",10,"80 mm",2000,3060,180,"T3-1000x80",80,"WDX356101-10-08-DMS"]
[null,null,null,"WDX356101",10,"100 mm",2000,3060,180,"T3-1000x100",100,"WDX356101-10-10-DMS"]
[null,null,null,"WDX356101",10,"125 mm",2000,3060,180,"T3-1000x125",125,"WDX356101-10-12-DMS"]
[null,null,null,"WDX356101",15,"25 mm",2000,3060,180,"T3-1500x25",25,"WDX356101-15-02-DMS"]
[null,null,null,"WDX356101",15,"38 mm",2000,3060,180,"T3-1500x38",38,"WDX356101-15-03-DMS"]
[null,null,null,"WDX356101",15,"50 mm",2000,3060,180,"T3-1500x50",50,"WDX356101-15-05-DMS"]
[null,null,null,"WDX356101",15,"63 mm",2000,3060,180,"T3-1500x63",63,"WDX356101-15-06-DMS"]
[null,null,null,"WDX356101",15,"80 mm",2000,3060,180,"T3-1500x80",80,"WDX356101-15-08-DMS"]
[null,null,null,"WDX356101",15,"100 mm",2000,3060,180,"T3-1500x100",100,"WDX356101-15-10-DMS"]
[null,null,null,"WDX356101",15,"125 mm",2000,3060,180,"T3-1500x125",125,"WDX356101-15-12-DMS"]
[null,null,null,"WDX356101",24,"25 mm",2000,3060,180,"T3-2400x25",25,"WDX356101-24-02-DMS"]
[null,null,null,"WDX356101",24,"38 mm",2000,3060,180,"T3-2400x38",38,"WDX356101-24-03-DMS"]
[null,null,null,"WDX356101",24,"50 mm",2000,3060,180,"T3-2400x50",50,"WDX356101-24-05-DMS"]
[null,null,null,"WDX356101",24,"63 mm",2000,3060,180,"T3-2400x63",63,"WDX356101-24-06-DMS"]
[null,null,null,"WDX356101",24,"80 mm",2000,3060,180,"T3-2400x80",80,"WDX356101-24-08-DMS"]
[null,null,null,"WDX356101",24,"100 mm",2000,3060,180,"T3-2400x100",100,"WDX356101-24-10-DMS"]
[null,null,null,"WDX356101",24,"125 mm",2000,3060,180,"T3-2400x125",125,"WDX356101-24-12-DMS"]
[null,null,null,"WDX356101",42,"25 mm",2000,3060,180,"T3-4200x25",25,"WDX356101-42-02-DMS"]
[null,null,null,"WDX356101",42,"38 mm",2000,3060,180,"T3-4200x38",38,"WDX356101-42-03-DMS"]
[null,null,null,"WDX356101",42,"50 mm",2000,3060,180,"T3-4200x50",50,"WDX356101-42-05-DMS"]
[null,null,null,"WDX356101",42,"63 mm",2000,3060,180,"T3-4200x63",63,"WDX356101-42-06-DMS"]
[null,null,null,"WDX356101",42,"80 mm",2000,3060,180,"T3-4200x80",80,"WDX356101-42-08-DMS"]
[null,null,null,"WDX356101",42,"100 mm",2000,3060,180,"T3-4200x100",100,"WDX356101-42-10-DMS"]
[null,null,null,"WDX356101",42,"125 mm",2000,3060,180,"T3-4200x125",125,"WDX356101-42-12-DMS"]
[null,null,null,"WDX356101",66,"25 mm",2000,3060,180,"T3-6600x25",25,"WDX356101-66-02-DMS"]
[null,null,null,"WDX356101",66,"38 mm",2000,3060,180,"T3-6600x38",38,"WDX356101-66-03-DMS"]
[null,null,null,"WDX356101",66,"50 mm",2000,3060,180,"T3-6600x50",50,"WDX356101-66-05-DMS"]
[null,null,null,"WDX356101",66,"63 mm",2000,3060,180,"T3-6600x63",63,"WDX356101-66-06-DMS"]
[null,null,null,"WDX356101",66,"80 mm",2000,3060,180,"T3-6600x80",80,"WDX356101-66-08-DMS"]
[null,null,null,"WDX356101",66,"100 mm",2000,3060,180,"T3-6600x100",100,"WDX356101-66-10-DMS"]
[null,null,null,"WDX356101",66,"125 mm",2000,3060,180,"T3-6600x125",125,"WDX356101-66-12-DMS"]
[null,null,null,"WDX356101",95,"25 mm",2000,3060,180,"T3-9500x25",25,"WDX356101-95-02-DMS"]
[null,null,null,"WDX356101",95,"38 mm",2000,3060,180,"T3-9500x38",38,"WDX356101-95-03-DMS"]
[null,null,null,"WDX356101",95,"50 mm",2000,3060,180,"T3-9500x50",50,"WDX356101-95-05-DMS"]
[null,null,null,"WDX356101",95,"63 mm",2000,3060,180,"T3-9500x63",63,"WDX356101-95-06-DMS"]
[null,null,null,"WDX356101",95,"80 mm",2000,3060,180,"T3-9500x80",80,"WDX356101-95-08-DMS"]
[null,null,null,"WDX356101",95,"100 mm",2000,3060,180,"T3-9500x100",100,"WDX356101-95-10-DMS"]
[null,null,null,"WDX356101",95,"125 mm",2000,3060,180,"T3-9500x125",125,"WDX356101-95-12-DMS"]

{"sheet":"GM","index":3,"n_rows":192,"n_cols":12,"rows_kept":192,"cut":false,"hidden":false,"merged":[]}
[null,null,null,"GM Series","GM Size","Stroke","Init Force","Final Force","Max Pres","Hyson Reference","mm","GM STRCode"]
[null,null,null,"90.25.00",2.5,"10 mm",2000,3060,180,"T2L-300x10",10,"90.25.00-2.5-10"]
[null,null,null,"90.25.00",2.5,"16 mm",2000,3060,180,"T2L-300x16",16,"90.25.00-2.5-16"]
[null,null,null,"90.25.00",2.5,"25 mm",2000,3060,180,"T2L-300x25",25,"90.25.00-2.5-25"]
[null,null,null,"90.25.00",2.5,"50 mm",2000,3060,180,"T2L-300x50",50,"90.25.00-2.5-50"]
[null,null,null,"90.25.00",2.5,"80 mm",2000,3060,180,"T2L-300x80",80,"90.25.00-2.5-80"]
[null,null,null,"90.25.00",2.5,"100 mm",2000,3060,180,"T2L-300x100",100,"90.25.00-2.5-100"]
[null,null,null,"90.25.00",2.5,"125 mm",2000,3060,180,"T2L-300x125",125,"90.25.00-2.5-125"]
[null,null,null,"90.25.00",5,"10 mm",106000,160000,150,"NP-500x10",10,"90.25.00-5-10"]
[null,null,null,"90.25.00",5,"25 mm",106000,160000,150,"NP-500x25",25,"90.25.00-5-25"]
[null,null,null,"90.25.00",5,"50 mm",106000,160000,150,"NP-500x50",50,"90.25.00-5-50"]
[null,null,null,"90.25.00",5,"80 mm",106000,160000,150,"NP-500x80",80,"90.25.00-5-80"]
[null,null,null,"90.25.00",5,"100 mm",106000,160000,150,"NP-500x100",100,"90.25.00-5-100"]
[null,null,null,"90.25.00",5,"125 mm",106000,160000,150,"NP-500x125",125,"90.25.00-5-125"]
[null,null,null,"90.25.00",5,"160 mm",106000,160000,150,"NP-500x160",160,"90.25.00-5-160"]
[null,null,null,"90.25.00",7.5,"25 mm",106000,160000,150,"NP-750x25",25,"90.25.00-7.5-25"]
[null,null,null,"90.25.00",7.5,"50 mm",106000,160000,150,"NP-750x50",50,"90.25.00-7.5-50"]
[null,null,null,"90.25.00",7.5,"80 mm",106000,160000,150,"NP-750x80",80,"90.25.00-7.5-80 "]
[null,null,null,"90.25.00",7.5,"100 mm",106000,160000,150,"NP-750x100",100,"90.25.00-7.5-100 "]
[null,null,null,"90.25.00",7.5,"125 mm",106000,160000,150,"NP-750x125",125,"90.25.00-7.5-125 "]
[null,null,null,"90.25.00",7.5,"160 mm",106000,160000,150,"NP-750x160",160,"90.25.00-7.5-160 "]
[null,null,null,"90.25.00",7.5,"200 mm",106000,160000,150,"NP-750x200",200,"90.25.00-7.5-200 "]
[null,null,null,"90.25.00",7.5,"250 mm",106000,160000,150,"NP-750x250",250,"90.25.00-7.5-250 "]
[null,null,null,"90.25.00",7.5,"300 mm",106000,160000,150,"NP-750x300",300,"90.25.00-7.5-300 "]
[null,null,null,"90.25.00",15,"25 mm",106000,160000,150,"NP-1500x25",25,"90.25.00-15-25 "]
[null,null,null,"90.25.00",15,"50 mm",106000,160000,150,"NP-1500x50",50,"90.25.00-15-50 "]
[null,null,null,"90.25.00",15,"80 mm",106000,160000,150,"NP-1500x80",80,"90.25.00-15-80 "]
[null,null,null,"90.25.00",15,"100 mm",106000,160000,150,"NP-1500x100",100,"90.25.00-15-100 "]
[null,null,null,"90.25.00",15,"125 mm",106000,160000,150,"NP-1500x125",125,"90.25.00-15-125 "]
[null,null,null,"90.25.00",15,"160 mm",106000,160000,150,"NP-1500x160",160,"90.25.00-15-160 "]
[null,null,null,"90.25.00",15,"200 mm",106000,160000,150,"NP-1500x200",200,"90.25.00-15-200 "]
[null,null,null,"90.25.00",15,"250 mm",106000,160000,150,"NP-1500x250",250,"90.25.00-15-250 "]
[null,null,null,"90.25.00",15,"300 mm",106000,160000,150,"NP-1500x300",300,"90.25.00-15-300 "]
[null,null,null,"90.25.00",30,"25 mm",106000,160000,150,"NP-3000x25",25,"90.25.00-30-25 "]
[null,null,null,"90.25.00",30,"50 mm",106000,160000,150,"NP-3000x50",50,"90.25.00-30-50 "]
[null,null,null,"90.25.00",30,"80 mm",106000,160000,150,"NP-3000x80",80,"90.25.00-30-80 "]
[null,null,null,"90.25.00",30,"100 mm",106000,160000,150,"NP-3000x100",100,"90.25.00-30-100 "]
[null,null,null,"90.25.00",30,"125 mm",106000,160000,150,"NP-3000x125",125,"90.25.00-30-125 "]
[null,null,null,"90.25.00",30,"160 mm",106000,160000,150,"NP-3000x160",160,"90.25.00-30-160 "]
[null,null,null,"90.25.00",30,"200 mm",106000,160000,150,"NP-3000x200",200,"90.25.00-30-200 "]
[null,null,null,"90.25.00",30,"250 mm",106000,160000,150,"NP-3000x250",250,"90.25.00-30-250 "]
[null,null,null,"90.25.00",30,"300 mm",106000,160000,150,"NP-3000x300",300,"90.25.00-30-300 "]
[null,null,null,"90.25.00",50,"25 mm",106000,160000,150,"NP-5000x25",25,"90.25.00-50-25 "]
[null,null,null,"90.25.00",50,"50 mm",106000,160000,150,"NP-5000x50",50,"90.25.00-50-50 "]
[null,null,null,"90.25.00",50,"80 mm",106000,160000,150,"NP-5000x80",80,"90.25.00-50-80 "]
[null,null,null,"90.25.00",50,"100 mm",106000,160000,150,"NP-5000x100",100,"90.25.00-50-100 "]
[null,null,null,"90.25.00",50,"125 mm",106000,160000,150,"NP-5000x125",125,"90.25.00-50-125 "]
[null,null,null,"90.25.00",50,"160 mm",106000,160000,150,"NP-5000x160",160,"90.25.00-50-160 "]
[null,null,null,"90.25.00",50,"200 mm",106000,160000,150,"NP-5000x200",200,"90.25.00-50-200 "]
[null,null,null,"90.25.00",50,"250 mm",106000,160000,150,"NP-5000x250",250,"90.25.00-50-250 "]
[null,null,null,"90.25.00",50,"300 mm",106000,160000,150,"NP-5000x300",300,"90.25.00-50-300 "]
[null,null,null,"90.25.00",75,"25 mm",106000,160000,150,"NP-7500x25",25,"90.25.00-75-25 "]
[null,null,null,"90.25.00",75,"50 mm",106000,160000,150,"NP-7500x50",50,"90.25.00-75-50 "]
[null,null,null,"90.25.00",75,"80 mm",106000,160000,150,"NP-7500x80",80,"90.25.00-75-80 "]
[null,null,null,"90.25.00",75,"100 mm",106000,160000,150,"NP-7500x100",100,"90.25.00-75-100 "]
[null,null,null,"90.25.00",75,"125 mm",106000,160000,150,"NP-7500x125",125,"90.25.00-75-125 "]
[null,null,null,"90.25.00",75,"160 mm",106000,160000,150,"NP-7500x160",160,"90.25.00-75-160 "]
[null,null,null,"90.25.00",75,"200 mm",106000,160000,150,"NP-7500x200",200,"90.25.00-75-200 "]
[null,null,null,"90.25.00",75,"250 mm",106000,160000,150,"NP-7500x250",250,"90.25.00-75-250 "]
[null,null,null,"90.25.00",75,"300 mm",106000,160000,150,"NP-7500x300",300,"90.25.00-75-300 "]
[null,null,null,"90.25.00",100,"25 mm",106000,160000,150,"NP-10000x25",25,"90.25.00-100-25 "]
[null,null,null,"90.25.00",100,"50 mm",106000,160000,150,"NP-10000x50",50,"90.25.00-100-50 "]
[null,null,null,"90.25.00",100,"80 mm",106000,160000,150,"NP-10000x80",80,"90.25.00-100-80 "]
[null,null,null,"90.25.00",100,"100 mm",106000,156000,150,"NP-10000x100",100,"90.25.00-100-100 "]
[null,null,null,"90.25.00",100,"125 mm",106000,157000,150,"NP-10000x125",125,"90.25.00-100-125 "]
[null,null,null,"90.25.00",100,"160 mm",106000,158000,150,"NP-10000x160",160,"90.25.00-100-160 "]
[null,null,null,"90.25.00",100,"200 mm",106000,160000,150,"NP-10000x200",200,"90.25.00-100-200 "]
[null,null,null,"90.25.00",100,"250 mm",106000,160000,150,"NP-10000x250",250,"90.25.00-100-250 "]
[null,null,null,"90.25.00",100,"300 mm",106000,160000,150,"NP-10000x300",300,"90.25.00-100-300 "]
[null,null,null,"90.25.05",7.5,"25 mm",24000,39300,150,"T4-750x25",25,"90.25.05-7.5-25 "]
[null,null,null,"90.25.05",7.5,"50 mm",24000,39300,150,"T4-750x50",50,"90.25.05-7.5-50 "]
[null,null,null,"90.25.05",7.5,"80 mm",24000,39300,150,"T4-750x80",80,"90.25.05-7.5-80 "]
[null,null,null,"90.25.05",7.5,"100 mm",24000,39300,150,"T4-750x100",100,"90.25.05-7.5-100 "]
[null,null,null,"90.25.05",7.5,"125 mm",24000,39300,150,"T4-750x125",125,"90.25.05-7.5-125 "]
[null,null,null,"90.25.05",7.5,"160 mm",24000,39300,150,"T4-750x160",160,"90.25.05-7.5-160 "]
[null,null,null,"90.25.05",7.5,"200 mm",24000,39300,150,"T4-750x200",200,"90.25.05-7.5-200 "]
[null,null,null,"90.25.05",10,"25 mm",24000,39300,150,"T4-1000x25",25,"90.25.05-10-25 "]
[null,null,null,"90.25.05",10,"50 mm",24000,39300,150,"T4-1000x50",50,"90.25.05-10-50 "]
[null,null,null,"90.25.05",10,"80 mm",24000,39300,150,"T4-1000x80",80,"90.25.05-10-80 "]
[null,null,null,"90.25.05",10,"100 mm",24000,39300,150,"T4-1000x100",100,"90.25.05-10-100 "]
[null,null,null,"90.25.05",10,"125 mm",24000,39300,150,"T4-1000x125",125,"90.25.05-10-125 "]
[null,null,null,"90.25.05",10,"160 mm",24000,39300,150,"T4-1000x160",160,"90.25.05-10-160 "]
[null,null,null,"90.25.05",10,"200 mm",24000,39300,150,"T4-1000x200",200,"90.25.05-10-200 "]
[null,null,null,"90.25.05",10,"250 mm",24000,39300,150,"T4-1000x250",250,"90.25.05-10-250 "]
[null,null,null,"90.25.05",10,"300 mm",24000,39300,150,"T4-1000x300",300,"90.25.05-10-300 "]
[null,null,null,"90.25.05",15,"25 mm",24000,39300,150,"T4-1500x25",25,"90.25.05-15-25 "]
[null,null,null,"90.25.05",15,"50 mm",24000,39300,150,"T4-1500x50",50,"90.25.05-15-50 "]
[null,null,null,"90.25.05",15,"80 mm",24000,39300,150,"T4-1500x80",80,"90.25.05-15-80 "]
[null,null,null,"90.25.05",15,"100 mm",24000,39300,150,"T4-1500x100",100,"90.25.05-15-100 "]
[null,null,null,"90.25.05",15,"125 mm",24000,39300,150,"T4-1500x125",125,"90.25.05-15-125 "]
[null,null,null,"90.25.05",15,"160 mm",24000,39300,150,"T4-1500x160",160,"90.25.05-15-160 "]
[null,null,null,"90.25.05",15,"200 mm",24000,39300,150,"T4-1500x200",200,"90.25.05-15-200 "]
[null,null,null,"90.25.05",15,"250 mm",24000,39300,150,"T4-1500x250",250,"90.25.05-15-250 "]
[null,null,null,"90.25.05",15,"300 mm",24000,39300,150,"T4-1500x300",300,"90.25.05-15-300 "]
[null,null,null,"90.25.05",24,"25 mm",24000,39300,150,"T4-2400x25",25,"90.25.05-24-25 "]
[null,null,null,"90.25.05",24,"50 mm",24000,39300,150,"T4-2400x50",50,"90.25.05-24-50 "]
[null,null,null,"90.25.05",24,"80 mm",24000,39300,150,"T4-2400x80",80,"90.25.05-24-80 "]
[null,null,null,"90.25.05",24,"100 mm",24000,39300,150,"T4-2400x100",100,"90.25.05-24-100 "]
[null,null,null,"90.25.05",24,"125 mm",24000,39300,150,"T4-2400x125",125,"90.25.05-24-125 "]
[null,null,null,"90.25.05",24,"160 mm",24000,39300,150,"T4-2400x160",160,"90.25.05-24-160 "]
[null,null,null,"90.25.05",24,"200 mm",24000,39300,150,"T4-2400x200",200,"90.25.05-24-200 "]
[null,null,null,"90.25.05",24,"250 mm",24000,39300,150,"T4-2400x250",250,"90.25.05-24-250 "]
[null,null,null,"90.25.05",24,"300 mm",24000,39300,150,"T4-2400x300",300,"90.25.05-24-300 "]
[null,null,null,"90.25.05",42,"25 mm",24000,39300,150,"T4-4200x25",25,"90.25.05-42-25 "]
[null,null,null,"90.25.05",42,"50 mm",24000,39300,150,"T4-4200x50",50,"90.25.05-42-50 "]
[null,null,null,"90.25.05",42,"80 mm",24000,39300,150,"T4-4200x80",80,"90.25.05-42-80 "]
[null,null,null,"90.25.05",42,"100 mm",24000,39300,150,"T4-4200x100",100,"90.25.05-42-100 "]
[null,null,null,"90.25.05",42,"125 mm",24000,39300,150,"T4-4200x125",125,"90.25.05-42-125 "]
[null,null,null,"90.25.05",42,"160 mm",24000,39300,150,"T4-4200x160",160,"90.25.05-42-160 "]
[null,null,null,"90.25.05",42,"200 mm",24000,39300,150,"T4-4200x200",200,"90.25.05-42-200 "]
[null,null,null,"90.25.05",42,"250 mm",24000,39300,150,"T4-4200x250",250,"90.25.05-42-250 "]
[null,null,null,"90.25.05",42,"300 mm",24000,39300,150,"T4-4200x300",300,"90.25.05-42-300 "]
[null,null,null,"90.25.05",42,"25 mm",24000,39300,150,"T4-6600x25",25,"90.25.05-42-25 "]
[null,null,null,"90.25.05",66,"50 mm",24000,39300,150,"T4-6600x50",50,"90.25.05-66-50 "]
[null,null,null,"90.25.05",66,"80 mm",24000,39300,150,"T4-6600x80",80,"90.25.05-66-80 "]
[null,null,null,"90.25.05",66,"100 mm",24000,39300,150,"T4-6600x100",100,"90.25.05-66-100 "]
[null,null,null,"90.25.05",66,"125 mm",24000,39300,150,"T4-6600x125",125,"90.25.05-66-125 "]
[null,null,null,"90.25.05",66,"160 mm",24000,39300,150,"T4-6600x160",160,"90.25.05-66-160 "]
[null,null,null,"90.25.05",66,"200 mm",24000,39300,150,"T4-6600x200",200,"90.25.05-66-200 "]
[null,null,null,"90.25.05",66,"250 mm",24000,39300,150,"T4-6600x250",250,"90.25.05-66-250 "]
[null,null,null,"90.25.05",66,"300 mm",24000,39300,150,"T4-6600x300",300,"90.25.05-66-300 "]
[null,null,null,"90.25.05",95,"25 mm",24000,39300,150,"T4-9500x25",25,"90.25.05-95-25 "]
[null,null,null,"90.25.05",95,"50 mm",24000,39300,150,"T4-9500x50",50,"90.25.05-95-50 "]
[null,null,null,"90.25.05",95,"80 mm",24000,39300,150,"T4-9500x80",80,"90.25.05-95-80 "]
[null,null,null,"90.25.05",95,"100 mm",24000,39300,150,"T4-9500x100",100,"90.25.05-95-100 "]
[null,null,null,"90.25.05",95,"125 mm",24000,39300,150,"T4-9500x125",125,"90.25.05-95-125 "]
[null,null,null,"90.25.05",95,"160 mm",24000,39300,150,"T4-9500x160",160,"90.25.05-95-160 "]
[null,null,null,"90.25.05",95,"200 mm",24000,39300,150,"T4-9500x200",200,"90.25.05-95-200 "]
[null,null,null,"90.25.05",95,"250 mm",24000,39300,150,"T4-9500x250",250,"90.25.05-95-250 "]
[null,null,null,"90.25.05",95,"300 mm",24000,39300,150,"T4-9500x300",300,"90.25.05-95-300 "]
[null,null,null,"90.25.08",3.5,"10 mm",2000,3060,180,"T3-350x10",10,"90.25.08-3.5-10 "]
[null,null,null,"90.25.08",3.5,"16 mm",2000,3060,180,"T3-350x16",16,"90.25.08-3.5-16 "]
[null,null,null,"90.25.08",3.5,"25 mm",2000,3060,180,"T3-350x25",25,"90.25.08-3.5-25 "]
[null,null,null,"90.25.08",3.5,"50 mm",2000,3060,180,"T3-350x50",50,"90.25.08-3.5-50 "]
[null,null,null,"90.25.08",3.5,"63 mm",2000,3060,180,"T3-350x63",63,"90.25.08-3.5-63 "]
[null,null,null,"90.25.08",3.5,"80 mm",2000,3060,180,"T3-350x80",80,"90.25.08-3.5-80 "]
[null,null,null,"90.25.08",3.5,"100 mm",2000,3060,180,"T3-350x100",100,"90.25.08-3.5-100 "]
[null,null,null,"90.25.08",3.5,"125 mm",2000,3060,180,"T3-350x125",125,"90.25.08-3.5-125 "]
[null,null,null,"90.25.08",5,"16 mm",2000,3060,180,"T3-500x16",16,"90.25.08-5-16 "]
[null,null,null,"90.25.08",5,"25 mm",2000,3060,180,"T3-500x25",25,"90.25.08-5-25 "]
[null,null,null,"90.25.08",5,"50 mm",2000,3060,180,"T3-500x50",50,"90.25.08-5-50 "]
[null,null,null,"90.25.08",5,"63 mm",2000,3060,180,"T3-500x63",63,"90.25.08-5-63 "]
[null,null,null,"90.25.08",5,"80 mm",2000,3060,180,"T3-500x80",80,"90.25.08-5-80 "]
[null,null,null,"90.25.08",5,"100 mm",2000,3060,180,"T3-500x100",100,"90.25.08-5-100 "]
[null,null,null,"90.25.08",5,"125 mm",2000,3060,180,"T3-500x125",125,"90.25.08-5-125 "]
[null,null,null,"90.25.08",7.5,"16 mm",2000,3060,180,"T3-750x16",16,"90.25.08-7.5-16 "]
[null,null,null,"90.25.08",7.5,"25 mm",2000,3060,180,"T3-750x25",25,"90.25.08-7.5-25 "]
[null,null,null,"90.25.08",7.5,"50 mm",2000,3060,180,"T3-750x50",50,"90.25.08-7.5-50 "]
[null,null,null,"90.25.08",7.5,"63 mm",2000,3060,180,"T3-750x63",63,"90.25.08-7.5-63 "]
[null,null,null,"90.25.08",7.5,"80 mm",2000,3060,180,"T3-750x80",80,"90.25.08-7.5-80 "]
[null,null,null,"90.25.08",7.5,"100 mm",2000,3060,180,"T3-750x100",100,"90.25.08-7.5-100 "]
[null,null,null,"90.25.08",7.5,"125 mm",2000,3060,180,"T3-750x125",125,"90.25.08-7.5-125 "]
[null,null,null,"90.25.08",10,"16 mm",2000,3060,180,"T3-1000x16",16,"90.25.08-10-16 "]
[null,null,null,"90.25.08",10,"25 mm",2000,3060,180,"T3-1000x25",25,"90.25.08-10-25 "]
[null,null,null,"90.25.08",10,"50 mm",2000,3060,180,"T3-1000x50",50,"90.25.08-10-50 "]
[null,null,null,"90.25.08",10,"63 mm",2000,3060,180,"T3-1000x63",63,"90.25.08-10-63 "]
[null,null,null,"90.25.08",10,"80 mm",2000,3060,180,"T3-1000x80",80,"90.25.08-10-80 "]
[null,null,null,"90.25.08",10,"100 mm",2000,3060,180,"T3-1000x100",100,"90.25.08-10-100 "]
[null,null,null,"90.25.08",10,"125 mm",2000,3060,180,"T3-1000x125",125,"90.25.08-10-125 "]
[null,null,null,"90.25.08",24,"16 mm",2000,3060,180,"T3-2400x16",16,"90.25.08-24-16 "]
[null,null,null,"90.25.08",24,"25 mm",2000,3060,180,"T3-2400x25",25,"90.25.08-24-25 "]
[null,null,null,"90.25.08",24,"50 mm",2000,3060,180,"T3-2400x50",50,"90.25.08-24-50 "]
[null,null,null,"90.25.08",24,"63 mm",2000,3060,180,"T3-2400x63",63,"90.25.08-24-63 "]
[null,null,null,"90.25.08",24,"80 mm",2000,3060,180,"T3-2400x80",80,"90.25.08-24-80 "]
[null,null,null,"90.25.08",24,"100 mm",2000,3060,180,"T3-2400x100",100,"90.25.08-24-100 "]
[null,null,null,"90.25.08",24,"125 mm",2000,3060,180,"T3-2400x125",125,"90.25.08-24-125 "]
[null,null,null,"90.25.08",42,"16 mm",2000,3060,180,"T3-4200x16",16,"90.25.08-42-16 "]
[null,null,null,"90.25.08",42,"25 mm",2000,3060,180,"T3-4200x25",25,"90.25.08-42-25 "]
[null,null,null,"90.25.08",42,"50 mm",2000,3060,180,"T3-4200x50",50,"90.25.08-42-50 "]
[null,null,null,"90.25.08",42,"63 mm",2000,3060,180,"T3-4200x63",63,"90.25.08-42-63 "]
[null,null,null,"90.25.08",42,"80 mm",2000,3060,180,"T3-4200x80",80,"90.25.08-42-80 "]
[null,null,null,"90.25.08",42,"100 mm",2000,3060,180,"T3-4200x100",100,"90.25.08-42-100 "]
[null,null,null,"90.25.08",42,"125 mm",2000,3060,180,"T3-4200x125",125,"90.25.08-42-125 "]
[null,null,null,"90.25.08",66,"16 mm",2000,3060,180,"T3-6600x16",16,"90.25.08-66-16 "]
[null,null,null,"90.25.08",66,"25 mm",2000,3060,180,"T3-6600x25",25,"90.25.08-66-25 "]
[null,null,null,"90.25.08",66,"50 mm",2000,3060,180,"T3-6600x50",50,"90.25.08-66-50 "]
[null,null,null,"90.25.08",66,"63 mm",2000,3060,180,"T3-6600x63",63,"90.25.08-66-63 "]
[null,null,null,"90.25.08",66,"80 mm",2000,3060,180,"T3-6600x80",80,"90.25.08-66-80 "]
[null,null,null,"90.25.08",66,"100 mm",2000,3060,180,"T3-6600x100",100,"90.25.08-66-100 "]
[null,null,null,"90.25.08",66,"125 mm",2000,3060,180,"T3-6600x125",125,"90.25.08-66-125 "]
[null,null,null,"90.25.08",95,"25 mm",2000,3060,180,"T3-9500x25",25,"90.25.08-95-25 "]
[null,null,null,"90.25.08",95,"50 mm",2000,3060,180,"T3-9500x50",50,"90.25.08-95-50 "]
[null,null,null,"90.25.08",95,"63 mm",2000,3060,180,"T3-9500x63",63,"90.25.08-95-63 "]
[null,null,null,"90.25.08",95,"80 mm",2000,3060,180,"T3-9500x80",80,"90.25.08-95-80 "]
[null,null,null,"90.25.08",95,"100 mm",2000,3060,180,"T3-9500x100",100,"90.25.08-95-100 "]
[null,null,null,"90.25.08",95,"125 mm",2000,3060,180,"T3-9500x125",125,"90.25.08-95-125 "]
[null,null,null,"90.25.08",199,"25 mm",2000,3060,180,"T3-20000x25",25,"90.25.08-199-25 "]
[null,null,null,"90.25.08",199,"50 mm",2000,3060,180,"T3-20000x50",50,"90.25.08-199-50 "]
[null,null,null,"90.25.08",199,"63 mm",2000,3060,180,"T3-20000x63",63,"90.25.08-199-63 "]
[null,null,null,"90.25.08",199,"80 mm",2000,3060,180,"T3-20000x80",80,"90.25.08-199-80 "]
[null,null,null,"90.25.08",199,"100 mm",2000,3060,180,"T3-20000x100",100,"90.25.08-199-100 "]
[null,null,null,"90.25.08",199,"125 mm",2000,3060,180,"T3-20000x125",125,"90.25.08-199-125 "]

{"sheet":"FCA","index":4,"n_rows":251,"n_cols":12,"rows_kept":251,"cut":false,"hidden":false,"merged":[]}
[null,null,null,"FCA Series","FCA Size","Stroke","Init Force","Final Force","Max Pres","Hyson Reference","mm","FCA STRCode"]
[null,null,null,"39-670-1","2 kN","15 mm",106000,160000,150,"T2-180x15",15,"39-670-1851"]
[null,null,null,"39-670-1","2 kN","25 mm",106000,160000,150,"T2-180x25",25,"39-670-1852"]
[null,null,null,"39-670-1","2 kN","38.1 mm",106000,160000,150,"T2-180x38.1",38.1,"39-670-1853"]
[null,null,null,"39-670-1","2 kN","50 mm",106000,160000,150,"T2-180x50",50,"39-670-1855"]
[null,null,null,"39-670-1","2 kN","63.5 mm",106000,160000,150,"T2-180x63.5",63.5,"39-670-1856"]
[null,null,null,"39-670-1","2 kN","80 mm",106000,160000,150,"T2-180x80",80,"39-670-1858"]
[null,null,null,"39-670-1","2 kN","100 mm",106000,160000,150,"T2-180x100",100,"39-670-1875"]
[null,null,null,"39-670-1","2 kN","125 mm",106000,160000,150,"T2-180x125",125,"39-670-1885"]
[null,null,null,"39-670-6",".9 kN","15 mm",2000,3060,180,"T2-90x15",15,"39-670-6715"]
[null,null,null,"39-670-6",".9 kN","25 mm",2000,3060,180,"T2-90x25",25,"39-670-6725"]
[null,null,null,"39-670-6",".9 kN","38.1 mm",2000,3060,180,"T2-90x38.1",38.1,"39-670-6738"]
[null,null,null,"39-670-6",".9 kN","50 mm",2000,3060,180,"T2-90x50",50,"39-670-6750"]
[null,null,null,"39-670-6",".9 kN","63.5 mm",2000,3060,180,"T2-90x63.5",63.5,"39-670-6760"]
[null,null,null,"39-670-6",".9 kN","80 mm",2000,3060,180,"T2-90x80",80,"39-670-6780"]
[null,null,null,"39-673-0","1.7 kN","10 mm",2000,3060,180,"T3-170x10",10,"39-673-0200"]
[null,null,null,"39-673-0","1.7 kN","15 mm",2000,3060,180,"T3-170x15",15,"39-673-0201"]
[null,null,null,"39-673-0","1.7 kN","25 mm",2000,3060,180,"T3-170x25",25,"39-673-0202"]
[null,null,null,"39-673-0","1.7 kN","38 mm",2000,3060,180,"T3-170x38",38,"39-673-0203"]
[null,null,null,"39-673-0","1.7 kN","50 mm",2000,3060,180,"T3-170x50",50,"39-673-0204"]
[null,null,null,"39-673-0","1.7 kN","63 mm",2000,3060,180,"T3-170x63",63,"39-673-0205"]
[null,null,null,"39-673-0","1.7 kN","80 mm",2000,3060,180,"T3-170x80",80,"39-673-0206"]
[null,null,null,"39-673-0","1.7 kN","100 mm",2000,3060,180,"T3-170x100",100,"39-673-0207"]
[null,null,null,"39-673-0","1.7 kN","125 mm",2000,3060,180,"T3-170x125",125,"39-673-0208"]
[null,null,null,"39-673-0","3.5 kN","10 mm",2000,3060,180,"T3-350x10",10,"39-673-0210"]
[null,null,null,"39-673-0","3.5 kN","13 mm",2000,3060,180,"T3-350x13",13,"39-673-0211"]
[null,null,null,"39-673-0","3.5 kN","16 mm",2000,3060,180,"T3-350x16",16,"39-673-0212"]
[null,null,null,"39-673-0","3.5 kN","25 mm",2000,3060,180,"T3-350x25",25,"39-673-0214"]
[null,null,null,"39-673-0","3.5 kN","38 mm",2000,3060,180,"T3-350x38",38,"39-673-0215"]
[null,null,null,"39-673-0","3.5 kN","50 mm",2000,3060,180,"T3-350x50",50,"39-673-0216"]
[null,null,null,"39-673-0","3.5 kN","63 mm",2000,3060,180,"T3-350x63",63,"39-673-0217"]
[null,null,null,"39-673-0","3.5 kN","80 mm",2000,3060,180,"T3-350x80",80,"39-673-0218"]
[null,null,null,"39-673-0","3.5 kN","100 mm",2000,3060,180,"T3-350x100",100,"39-673-0219"]
[null,null,null,"39-673-0","3.5 kN","125 mm",2000,3060,180,"T3-350x125",125,"39-673-0220"]
[null,null,null,"39-673-0","5 kN","10 mm",2000,3060,180,"T3-500x10",10,"39-673-0222"]
[null,null,null,"39-673-0","5 kN","13 mm",2000,3060,180,"T3-500x13",13,"39-673-0223"]
[null,null,null,"39-673-0","5 kN","16 mm",2000,3060,180,"T3-500x16",16,"39-673-0224"]
[null,null,null,"39-673-0","5 kN","25 mm",2000,3060,180,"T3-500x25",25,"39-673-0226"]
[null,null,null,"39-673-0","5 kN","38 mm",2000,3060,180,"T3-500x38",38,"39-673-0227"]
[null,null,null,"39-673-0","5 kN","50 mm",2000,3060,180,"T3-500x50",50,"39-673-0228"]
[null,null,null,"39-673-0","5 kN","63 mm",2000,3060,180,"T3-500x63",63,"39-673-0229"]
[null,null,null,"39-673-0","5 kN","80 mm",2000,3060,180,"T3-500x80",80,"39-673-0230"]
[null,null,null,"39-673-0","5 kN","100 mm",2000,3060,180,"T3-500x100",100,"39-673-0231"]
[null,null,null,"39-673-0","5 kN","125 mm",2000,3060,180,"T3-500x125",125,"39-673-0232"]
[null,null,null,"39-673-0","7.5 kN","13 mm",2000,3060,180,"T3F-750x13",13,"39-673-0234"]
[null,null,null,"39-673-0","7.5 kN","25 mm",2000,3060,180,"T3F-750x25",25,"39-673-0235"]
[null,null,null,"39-673-0","7.5 kN","38 mm",2000,3060,180,"T3F-750x38",38,"39-673-0236"]
[null,null,null,"39-673-0","7.5 kN","50 mm",2000,3060,180,"T3F-750x50",50,"39-673-0237"]
[null,null,null,"39-673-0","7.5 kN","63 mm",2000,3060,180,"T3F-750x63",63,"39-673-0238"]
[null,null,null,"39-673-0","7.5 kN","80 mm",2000,3060,180,"T3F-750x80",80,"39-673-0239"]
[null,null,null,"39-673-0","7.5 kN","100 mm",2000,3060,180,"T3F-750x100",100,"39-673-0240"]
[null,null,null,"39-673-0","7.5 kN","125 mm",2000,3060,180,"T3F-750x125",125,"39-673-0241"]
[null,null,null,"39-673-0","10 kN","13 mm",2000,3060,180,"T3F-1000x13",13,"39-673-0242"]
[null,null,null,"39-673-0","10 kN","25 mm",2000,3060,180,"T3F-1000x25",25,"39-673-0243"]
[null,null,null,"39-673-0","10 kN","38 mm",2000,3060,180,"T3F-1000x38",38,"39-673-0244"]
[null,null,null,"39-673-0","10 kN","50 mm",2000,3060,180,"T3F-1000x50",50,"39-673-0245"]
[null,null,null,"39-673-0","10 kN","63 mm",2000,3060,180,"T3F-1000x63",63,"39-673-0246"]
[null,null,null,"39-673-0","10 kN","80 mm",2000,3060,180,"T3F-1000x80",80,"39-673-0247"]
[null,null,null,"39-673-0","10 kN","100 mm",2000,3060,180,"T3F-1000x100",100,"39-673-0248"]
[null,null,null,"39-673-0","10 kN","125 mm",2000,3060,180,"T3F-1000x125",125,"39-673-0249"]
[null,null,null,"39-673-0","15 kN","13 mm",2000,3060,180,"T3F-1500x13",13,"39-673-0251"]
[null,null,null,"39-673-0","15 kN","25 mm",2000,3060,180,"T3F-1500x25",25,"39-673-0252"]
[null,null,null,"39-673-0","15 kN","38 mm",2000,3060,180,"T3F-1500x38",38,"39-673-0253"]
[null,null,null,"39-673-0","15 kN","50 mm",2000,3060,180,"T3F-1500x50",50,"39-673-0254"]
[null,null,null,"39-673-0","15 kN","63 mm",2000,3060,180,"T3F-1500x63",63,"39-673-0255"]
[null,null,null,"39-673-0","15 kN","80 mm",2000,3060,180,"T3F-1500x80",80,"39-673-0256"]
[null,null,null,"39-673-0","15 kN","100 mm",2000,3060,180,"T3F-1500x100",100,"39-673-0257"]
[null,null,null,"39-673-0","15 kN","125 mm",2000,3060,180,"T3F-1500x125",125,"39-673-0258"]
[null,null,null,"39-673-0","24 kN","25 mm",2000,3060,180,"T3F-2400x25",25,"39-673-0260"]
[null,null,null,"39-673-0","24 kN","38 mm",2000,3060,180,"T3F-2400x38",38,"39-673-0261"]
[null,null,null,"39-673-0","24 kN","50 mm",2000,3060,180,"T3F-2400x50",50,"39-673-0262"]
[null,null,null,"39-673-0","24 kN","63 mm",2000,3060,180,"T3F-2400x63",63,"39-673-0263"]
[null,null,null,"39-673-0","24 kN","80 mm",2000,3060,180,"T3F-2400x80",80,"39-673-0264"]
[null,null,null,"39-673-0","24 kN","100 mm",2000,3060,180,"T3F-2400x100",100,"39-673-0265"]
[null,null,null,"39-673-0","24 kN","125 mm",2000,3060,180,"T3F-2400x125",125,"39-673-0266"]
[null,null,null,"39-673-0","42 kN","25 mm",2000,3060,180,"T3-4200x25",25,"39-673-0268"]
[null,null,null,"39-673-0","42 kN","38 mm",2000,3060,180,"T3-4200x38",38,"39-673-0269"]
[null,null,null,"39-673-0","42 kN","50 mm",2000,3060,180,"T3-4200x50",50,"39-673-0270"]
[null,null,null,"39-673-0","42 kN","63 mm",2000,3060,180,"T3-4200x63",63,"39-673-0271"]
[null,null,null,"39-673-0","42 kN","80 mm",2000,3060,180,"T3-4200x80",80,"39-673-0272"]
[null,null,null,"39-673-0","42 kN","100 mm",2000,3060,180,"T3-4200x100",100,"39-673-0273"]
[null,null,null,"39-673-0","42 kN","125 mm",2000,3060,180,"T3-4200x125",125,"39-673-0274"]
[null,null,null,"39-673-0","66 kN","25 mm",2000,3060,180,"T3-6600x25",25,"39-673-0276"]
[null,null,null,"39-673-0","66 kN","38 mm",2000,3060,180,"T3-6600x38",38,"39-673-0277"]
[null,null,null,"39-673-0","66 kN","50 mm",2000,3060,180,"T3-6600x50",50,"39-673-0278"]
[null,null,null,"39-673-0","66 kN","63 mm",2000,3060,180,"T3-6600x63",63,"39-673-0279"]
[null,null,null,"39-673-0","66 kN","80 mm",2000,3060,180,"T3-6600x80",80,"39-673-0280"]
[null,null,null,"39-673-0","66 kN","100 mm",2000,3060,180,"T3-6600x100",100,"39-673-0281"]
[null,null,null,"39-673-0","66 kN","125 mm",2000,3060,180,"T3-6600x125",125,"39-673-0282"]
[null,null,null,"39-673-0","95 kN","25 mm",2000,3060,180,"T3-9500x25",25,"39-673-0284"]
[null,null,null,"39-673-0","95 kN","38 mm",2000,3060,180,"T3-9500x38",38,"39-673-0285"]
[null,null,null,"39-673-0","95 kN","50 mm",2000,3060,180,"T3-9500x50",50,"39-673-0286"]
[null,null,null,"39-673-0","95 kN","63 mm",2000,3060,180,"T3-9500x63",63,"39-673-0287"]
[null,null,null,"39-673-0","95 kN","80 mm",2000,3060,180,"T3-9500x80",80,"39-673-0288"]
[null,null,null,"39-673-0","95 kN","100 mm",2000,3060,180,"T3-9500x100",100,"39-673-0289"]
[null,null,null,"39-673-0","95 kN","125 mm",2000,3060,180,"T3-9500x125",125,"39-673-0290"]
[null,null,null,"39-673-5","2.5 kN","10 mm",2000,3060,180,"T2L-300x10",10,"39-673-5646"]
[null,null,null,"39-673-5","2.5 kN","0.50 in",2000,3060,180,"T2L-300x0.50",12.7,"39-673-5647"]
[null,null,null,"39-673-5","2.5 kN","16 mm",2000,3060,180,"T2L-300x16",16,"39-673-5648"]
[null,null,null,"39-673-5","2.5 kN","0.75 in",2000,3060,180,"T2L-300x0.75",19.049999999999997,"39-673-5649"]
[null,null,null,"39-673-5","2.5 kN","25 mm",2000,3060,180,"T2L-300x25",25,"39-673-5650"]
[null,null,null,"39-673-5","2.5 kN","1.50 in",2000,3060,180,"T2L-300x1.50",38.099999999999994,"39-673-5651"]
[null,null,null,"39-673-5","2.5 kN","50 mm",2000,3060,180,"T2L-300x50",50,"39-673-5652"]
[null,null,null,"39-673-5","2.5 kN","2.50 in",2000,3060,180,"T2L-300x2.50",63.5,"39-673-5653"]
[null,null,null,"39-673-5","2.5 kN","80 mm",2000,3060,180,"T2L-300x80",80,"39-673-5654"]
[null,null,null,"39-673-5","2.5 kN","100 mm",2000,3060,180,"T2L-300x100",100,"39-673-5655"]
[null,null,null,"39-673-5","2.5 kN","125 mm",2000,3060,180,"T2L-300x125",125,"39-673-5656"]
[null,null,null,"39-673-5","5 kN","25 mm",106000,160000,150,"NP-500x25",25,"39-673-5002"]
[null,null,null,"39-673-5","5 kN","38.1 mm",106000,160000,150,"NP-500x38.1",38.1,"39-673-5003"]
[null,null,null,"39-673-5","5 kN","50 mm",106000,160000,150,"NP-500x50",50,"39-673-5005"]
[null,null,null,"39-673-5","5 kN","63.5 mm",106000,160000,150,"NP-500x63.5",63.5,"39-673-5006"]
[null,null,null,"39-673-5","5 kN","80 mm",106000,160000,150,"NP-500x80",80,"39-673-5008"]
[null,null,null,"39-673-5","5 kN","100 mm",106000,160000,150,"NP-500x100",100,"39-673-5010"]
[null,null,null,"39-673-5","5 kN","125 mm",106000,160000,150,"NP-500x125",125,"39-673-5012"]
[null,null,null,"39-673-5","5 kN","160 mm",106000,160000,150,"NP-500x160",160,"39-673-5016"]
[null,null,null,"39-673-5","7.5 kN","12.7 mm",106000,160000,150,"NP-750x12.7",12.7,"39-673-5101"]
[null,null,null,"39-673-5","7.5 kN","25 mm",106000,160000,150,"NP-750x25",25,"39-673-5102"]
[null,null,null,"39-673-5","7.5 kN","38.1 mm",106000,160000,150,"NP-750x38.1",38.1,"39-673-5103"]
[null,null,null,"39-673-5","7.5 kN","50 mm",106000,160000,150,"NP-750x50",50,"39-673-5105"]
[null,null,null,"39-673-5","7.5 kN","63.5 mm",106000,160000,150,"NP-750x63.5",63.5,"39-673-5106"]
[null,null,null,"39-673-5","7.5 kN","80 mm",106000,160000,150,"NP-750x80",80,"39-673-5108"]
[null,null,null,"39-673-5","7.5 kN","100 mm",106000,160000,150,"NP-750x100",100,"39-673-5110"]
[null,null,null,"39-673-5","7.5 kN","125 mm",106000,160000,150,"NP-750x125",125,"39-673-5112"]
[null,null,null,"39-673-5","7.5 kN","160 mm",106000,160000,150,"NP-750x160",160,"39-673-5116"]
[null,null,null,"39-673-5","7.5 kN","200 mm",106000,160000,150,"NP-750x200",200,"39-673-5120"]
[null,null,null,"39-673-5","7.5 kN","250 mm",106000,160000,150,"NP-750x250",250,"39-673-5125"]
[null,null,null,"39-673-5","7.5 kN","300 mm",106000,160000,150,"NP-750x300",300,"39-673-5130"]
[null,null,null,"39-673-5","15 kN","12.7 mm",106000,160000,150,"NP-1500x12.7",12.7,"39-673-5201"]
[null,null,null,"39-673-5","15 kN","25 mm",106000,160000,150,"NP-1500x25",25,"39-673-5202"]
[null,null,null,"39-673-5","15 kN","38.1 mm",106000,160000,150,"NP-1500x38.1",38.1,"39-673-5203"]
[null,null,null,"39-673-5","15 kN","50 mm",106000,160000,150,"NP-1500x50",50,"39-673-5205"]
[null,null,null,"39-673-5","15 kN","63.5 mm",106000,160000,150,"NP-1500x63.5",63.5,"39-673-5206"]
[null,null,null,"39-673-5","15 kN","80 mm",106000,160000,150,"NP-1500x80",80,"39-673-5208"]
[null,null,null,"39-673-5","15 kN","100 mm",106000,160000,150,"NP-1500x100",100,"39-673-5210"]
[null,null,null,"39-673-5","15 kN","125 mm",106000,160000,150,"NP-1500x125",125,"39-673-5212"]
[null,null,null,"39-673-5","15 kN","160 mm",106000,160000,150,"NP-1500x160",160,"39-673-5216"]
[null,null,null,"39-673-5","15 kN","200 mm",106000,160000,150,"NP-1500x200",200,"39-673-5220"]
[null,null,null,"39-673-5","15 kN","250 mm",106000,160000,150,"NP-1500x250",250,"39-673-5225"]
[null,null,null,"39-673-5","15 kN","300 mm",106000,160000,150,"NP-1500x300",300,"39-673-5230"]
[null,null,null,"39-673-5","30 kN","12.7 mm",106000,160000,150,"NP-3000x12.7",12.7,"39-673-5301"]
[null,null,null,"39-673-5","30 kN","25 mm",106000,160000,150,"NP-3000x25",25,"39-673-5302"]
[null,null,null,"39-673-5","30 kN","38.1 mm",106000,160000,150,"NP-3000x38.1",38.1,"39-673-5303"]
[null,null,null,"39-673-5","30 kN","50 mm",106000,160000,150,"NP-3000x50",50,"39-673-5305"]
[null,null,null,"39-673-5","30 kN","63.5 mm",106000,160000,150,"NP-3000x63.5",63.5,"39-673-5306"]
[null,null,null,"39-673-5","30 kN","80 mm",106000,160000,150,"NP-3000x80",80,"39-673-5308"]
[null,null,null,"39-673-5","30 kN","100 mm",106000,160000,150,"NP-3000x100",100,"39-673-5310"]
[null,null,null,"39-673-5","30 kN","125 mm",106000,160000,150,"NP-3000x125",125,"39-673-5312"]
[null,null,null,"39-673-5","30 kN","160 mm",106000,160000,150,"NP-3000x160",160,"39-673-5316"]
[null,null,null,"39-673-5","30 kN","200 mm",106000,160000,150,"NP-3000x200",200,"39-673-5320"]
[null,null,null,"39-673-5","30 kN","250 mm",106000,160000,150,"NP-3000x250",250,"39-673-5325"]
[null,null,null,"39-673-5","30 kN","300 mm",106000,160000,150,"NP-3000x300",300,"39-673-5330"]
[null,null,null,"39-673-5","50 kN","25 mm",106000,160000,150,"NP-5000x25",25,"39-673-5402"]
[null,null,null,"39-673-5","50 kN","38.1 mm",106000,160000,150,"NP-5000x38.1",38.1,"39-673-5403"]
[null,null,null,"39-673-5","50 kN","50 mm",106000,160000,150,"NP-5000x50",50,"39-673-5405"]
[null,null,null,"39-673-5","50 kN","63.5 mm",106000,160000,150,"NP-5000x63.5",63.5,"39-673-5406"]
[null,null,null,"39-673-5","50 kN","80 mm",106000,160000,150,"NP-5000x80",80,"39-673-5408"]
[null,null,null,"39-673-5","50 kN","100 mm",106000,160000,150,"NP-5000x100",100,"39-673-5410"]
[null,null,null,"39-673-5","50 kN","125 mm",106000,160000,150,"NP-5000x125",125,"39-673-5412"]
[null,null,null,"39-673-5","50 kN","160 mm",106000,160000,150,"NP-5000x160",160,"39-673-5416"]
[null,null,null,"39-673-5","50 kN","200 mm",106000,160000,150,"NP-5000x200",200,"39-673-5420"]
[null,null,null,"39-673-5","50 kN","250 mm",106000,160000,150,"NP-5000x250",250,"39-673-5425"]
[null,null,null,"39-673-5","50 kN","300 mm",106000,160000,150,"NP-5000x300",300,"39-673-5430"]
[null,null,null,"39-673-5","75 kN","25 mm",106000,160000,150,"NP-7500x25",25,"39-673-5502"]
[null,null,null,"39-673-5","75 kN","38.1 mm",106000,160000,150,"NP-7500x38.1",38.1,"39-673-5503"]
[null,null,null,"39-673-5","75 kN","50 mm",106000,160000,150,"NP-7500x50",50,"39-673-5505"]
[null,null,null,"39-673-5","75 kN","63.5 mm",106000,160000,150,"NP-7500x63.5",63.5,"39-673-5506"]
[null,null,null,"39-673-5","75 kN","80 mm",106000,160000,150,"NP-7500x80",80,"39-673-5508"]
[null,null,null,"39-673-5","75 kN","100 mm",106000,160000,150,"NP-7500x100",100,"39-673-5510"]
[null,null,null,"39-673-5","75 kN","125 mm",106000,160000,150,"NP-7500x125",125,"39-673-5512"]
[null,null,null,"39-673-5","75 kN","160 mm",106000,160000,150,"NP-7500x160",160,"39-673-5516"]
[null,null,null,"39-673-5","75 kN","200 mm",106000,160000,150,"NP-7500x200",200,"39-673-5520"]
[null,null,null,"39-673-5","75 kN","250 mm",106000,160000,150,"NP-7500x250",250,"39-673-5525"]
[null,null,null,"39-673-5","75 kN","300 mm",106000,160000,150,"NP-7500x300",300,"39-673-5530"]
[null,null,null,"39-673-5","100 kN","25 mm",106000,160000,150,"NP-10000x25",25,"39-673-5602"]
[null,null,null,"39-673-5","100 kN","38.1 mm",106000,160000,150,"NP-10000x38.1",38.1,"39-673-5603"]
[null,null,null,"39-673-5","100 kN","50 mm",106000,160000,150,"NP-10000x50",50,"39-673-5605"]
[null,null,null,"39-673-5","100 kN","63.5 mm",106000,160000,150,"NP-10000x63.5",63.5,"39-673-56506"]
[null,null,null,"39-673-5","100 kN","80 mm",106000,160000,150,"NP-10000x80",80,"39-673-5608"]
[null,null,null,"39-673-5","100 kN","100 mm",106000,156000,150,"NP-10000x100",100,"39-673-5610"]
[null,null,null,"39-673-5","100 kN","125 mm",106000,157000,150,"NP-10000x125",125,"39-673-5612"]
[null,null,null,"39-673-5","100 kN","160 mm",106000,158000,150,"NP-10000x160",160,"39-673-5616"]
[null,null,null,"39-673-5","100 kN","200 mm",106000,160000,150,"NP-10000x200",200,"39-673-5620"]
[null,null,null,"39-673-5","100 kN","250 mm",106000,160000,150,"NP-10000x250",250,"39-673-5625"]
[null,null,null,"39-673-5","100 kN","300 mm",106000,160000,150,"NP-10000x300",300,"39-673-5630"]
[null,null,null,"39-673-8","10 kN","12.7 mm",24000,39300,150,"T4-1000x12.7",12.7,"39-673-8278"]
[null,null,null,"39-673-8","10 kN","25 mm",24000,39300,150,"T4-1000x25",25,"39-673-8279"]
[null,null,null,"39-673-8","10 kN","38.1 mm",24000,39300,150,"T4-1000x38.1",38.1,"39-673-8280"]
[null,null,null,"39-673-8","10 kN","50 mm",24000,39300,150,"T4-1000x50",50,"39-673-8281"]
[null,null,null,"39-673-8","10 kN","63.5 mm",24000,39300,150,"T4-1000x63.5",63.5,"39-673-8282"]
[null,null,null,"39-673-8","10 kN","80 mm",24000,39300,150,"T4-1000x80",80,"39-673-8283"]
[null,null,null,"39-673-8","10 kN","100 mm",24000,39300,150,"T4-1000x100",100,"39-673-8284"]
[null,null,null,"39-673-8","10 kN","125 mm",24000,39300,150,"T4-1000x125",125,"39-673-8285"]
[null,null,null,"39-673-8","10 kN","160 mm",24000,39300,150,"T4-1000x160",160,"39-673-8286"]
[null,null,null,"39-673-8","10 kN","200 mm",24000,39300,150,"T4-1000x200",200,"39-673-8287"]
[null,null,null,"39-673-8","10 kN","250 mm",24000,39300,150,"T4-1000x250",250,"39-673-8288"]
[null,null,null,"39-673-8","10 kN","300 mm",24000,39300,150,"T4-1000x300",300,"39-673-8289"]
[null,null,null,"39-673-8","24 kN","25 mm",24000,39300,150,"T4-2400x25",25,"39-673-8291"]
[null,null,null,"39-673-8","24 kN","38.1 mm",24000,39300,150,"T4-2400x38.1",38.1,"39-673-8292"]
[null,null,null,"39-673-8","24 kN","50 mm",24000,39300,150,"T4-2400x50",50,"39-673-8293"]
[null,null,null,"39-673-8","24 kN","63.5 mm",24000,39300,150,"T4-2400x63.5",63.5,"39-673-8294"]
[null,null,null,"39-673-8","24 kN","80 mm",24000,39300,150,"T4-2400x80",80,"39-673-8295"]
[null,null,null,"39-673-8","24 kN","100 mm",24000,39300,150,"T4-2400x100",100,"39-673-8296"]
[null,null,null,"39-673-8","24 kN","125 mm",24000,39300,150,"T4-2400x125",125,"39-673-8297"]
[null,null,null,"39-673-8","24 kN","160 mm",24000,39300,150,"T4-2400x160",160,"39-673-8298"]
[null,null,null,"39-673-8","24 kN","200 mm",24000,39300,150,"T4-2400x200",200,"39-673-8299"]
[null,null,null,"39-673-8","24 kN","250 mm",24000,39300,150,"T4-2400x250",250,"39-673-8300"]
[null,null,null,"39-673-8","24 kN","300 mm",24000,39300,150,"T4-2400x300",300,"39-673-8301"]
[null,null,null,"39-673-8","42 kN","25 mm",24000,39300,150,"T4-4200x25",25,"39-673-8402"]
[null,null,null,"39-673-8","42 kN","38.1 mm",24000,39300,150,"T4-4200x38.1",38.1,"39-673-8403"]
[null,null,null,"39-673-8","42 kN","50 mm",24000,39300,150,"T4-4200x50",50,"39-673-8405"]
[null,null,null,"39-673-8","42 kN","63.5 mm",24000,39300,150,"T4-4200x63.5",63.5,"39-673-8406"]
[null,null,null,"39-673-8","42 kN","80 mm",24000,39300,150,"T4-4200x80",80,"39-673-8408"]
[null,null,null,"39-673-8","42 kN","100 mm",24000,39300,150,"T4-4200x100",100,"39-673-8410"]
[null,null,null,"39-673-8","42 kN","125 mm",24000,39300,150,"T4-4200x125",125,"39-673-8412"]
[null,null,null,"39-673-8","42 kN","160 mm",24000,39300,150,"T4-4200x160",160,"39-673-8416"]
[null,null,null,"39-673-8","42 kN","200 mm",24000,39300,150,"T4-4200x200",200,"39-673-8420"]
[null,null,null,"39-673-8","42 kN","250 mm",24000,39300,150,"T4-4200x250",250,"39-673-8425"]
[null,null,null,"39-673-8","42 kN","300 mm",24000,39300,150,"T4-4200x300",300,"39-673-8430"]
[null,null,null,"39-673-8","66 kN","25 mm",24000,39300,150,"T4-6600x25",25,"39-673-8502"]
[null,null,null,"39-673-8","66 kN","38.1 mm",24000,39300,150,"T4-6600x38.1",38.1,"39-673-8503"]
[null,null,null,"39-673-8","66 kN","50 mm",24000,39300,150,"T4-6600x50",50,"39-673-8505"]
[null,null,null,"39-673-8","66 kN","63.5 mm",24000,39300,150,"T4-6600x63.5",63.5,"39-673-8506"]
[null,null,null,"39-673-8","66 kN","80 mm",24000,39300,150,"T4-6600x80",80,"39-673-8508"]
[null,null,null,"39-673-8","66 kN","100 mm",24000,39300,150,"T4-6600x100",100,"39-673-8510"]
[null,null,null,"39-673-8","66 kN","125 mm",24000,39300,150,"T4-6600x125",125,"39-673-8512"]
[null,null,null,"39-673-8","66 kN","160 mm",24000,39300,150,"T4-6600x160",160,"39-673-8516"]
[null,null,null,"39-673-8","66 kN","200 mm",24000,39300,150,"T4-6600x200",200,"39-673-8520"]
[null,null,null,"39-673-8","66 kN","250 mm",24000,39300,150,"T4-6600x250",250,"39-673-8525"]
[null,null,null,"39-673-8","66 kN","300 mm",24000,39300,150,"T4-6600x300",300,"39-673-8530"]
[null,null,null,"39-673-8","95 kN","25 mm",24000,39300,150,"T4-9500x25",25,"39-673-8602"]
[null,null,null,"39-673-8","95 kN","38.1 mm",24000,39300,150,"T4-9500x38.1",38.1,"39-673-8603"]
[null,null,null,"39-673-8","95 kN","50 mm",24000,39300,150,"T4-9500x50",50,"39-673-8605"]
[null,null,null,"39-673-8","95 kN","63.5 mm",24000,39300,150,"T4-9500x63.5",63.5,"39-673-8606"]
[null,null,null,"39-673-8","95 kN","80 mm",24000,39300,150,"T4-9500x80",80,"39-673-8608"]
[null,null,null,"39-673-8","95 kN","100 mm",24000,39300,150,"T4-9500x100",100,"39-673-8610"]
[null,null,null,"39-673-8","95 kN","125 mm",24000,39300,150,"T4-9500x125",125,"39-673-8612"]
[null,null,null,"39-673-8","95 kN","160 mm",24000,39300,150,"T4-9500x160",160,"39-673-8616"]
[null,null,null,"39-673-8","95 kN","200 mm",24000,39300,150,"T4-9500x200",200,"39-673-8620"]
[null,null,null,"39-673-8","95 kN","250 mm",24000,39300,150,"T4-9500x250",250,"39-673-8625"]
[null,null,null,"39-673-8","95 kN","300 mm",24000,39300,150,"T4-9500x300",300,"39-673-8630"]
[null,null,null,"39-673-8","199 kN","25 mm",24000,39300,150,"T4-20000x25",25,"39-673-8702"]
[null,null,null,"39-673-8","199 kN","38.1 mm",24000,39300,150,"T4-20000x38.1",38.1,"39-673-8703"]
[null,null,null,"39-673-8","199 kN","50 mm",24000,39300,150,"T4-20000x50",50,"39-673-8705"]
[null,null,null,"39-673-8","199 kN","63.5 mm",24000,39300,150,"T4-20000x63.5",63.5,"39-673-8706"]
[null,null,null,"39-673-8","199 kN","80 mm",24000,39300,150,"T4-20000x80",80,"39-673-8708"]
[null,null,null,"39-673-8","199 kN","100 mm",24000,39300,150,"T4-20000x100",100,"39-673-8710"]
[null,null,null,"39-673-8","199 kN","125 mm",24000,39300,150,"T4-20000x125",125,"39-673-8712"]
[null,null,null,"39-673-8","199 kN","160 mm",24000,39300,150,"T4-20000x160",160,"39-673-8716"]
[null,null,null,"39-673-8","199 kN","200 mm",24000,39300,150,"T4-20000x200",200,"39-673-8720"]
[null,null,null,"39-673-8","199 kN","250 mm",24000,39300,150,"T4-20000x250",250,"39-673-8725"]
[null,null,null,"39-673-8","199 kN","300 mm",24000,39300,150,"T4-20000x300",300,"39-673-8730"]

{"sheet":"Kaller","index":5,"n_rows":732,"n_cols":15,"rows_kept":732,"cut":false,"hidden":true,"merged":[]}
[null,null,null,"Family","Size","Stroke","Init Force","Final Force","Max Pres","Hyson Reference","mm","Kaller Str Code",null,"Unit","Number with dot"]
[null,null,null,"TU",250,"10 mm",2000,3060,180,"T2L-300x10",{"$f":"IF(N2=\"mm\",O2,O2*25.4)","v":10},"TU 250-10",null,{"$f":"RIGHT(F2,2)","v":"mm"},{"$f":"VALUE(SUBSTITUTE(LEFT(F2,SEARCH(\" \",F2)-1),\".\",\",\"))","v":10}]
[null,null,null,"TU",250,"0.50 in",2000,3060,180,"T2L-300x0.50",12.7,"TU 250-12,7",null,"in",0.5]
[null,null,null,"TU",250,"16 mm",2000,3060,180,"T2L-300x16",16,"TU 250-16",null,"mm",16]
[null,null,null,"TU",250,"25 mm",2000,3060,180,"T2L-300x25",25,"TU 250-25",null,"mm",25]
[null,null,null,"TU",250,"1.50 in",2000,3060,180,"T2L-300x1.50",38.099999999999994,"TU 250-38,1",null,"in",1.5]
[null,null,null,"TU",250,"50 mm",2000,3060,180,"T2L-300x50",50,"TU 250-50",null,"mm",50]
[null,null,null,"TU",250,"2.50 in",2000,3060,180,"T2L-300x2.50",63.5,"TU 250-63,5",null,"in",2.5]
[null,null,null,"TU",250,"80 mm",2000,3060,180,"T2L-300x80",80,"TU 250-80",null,"mm",80]
[null,null,null,"TU",250,"100 mm",2000,3060,180,"T2L-300x100",100,"TU 250-100",null,"mm",100]
[null,null,null,"TU",250,"125 mm",2000,3060,180,"T2L-300x125",125,"TU 250-125",null,"mm",125]
[null,null,null,"TU",500,"10 mm",106000,160000,150,"NP-500x10",10,"TU 500-10",null,"mm",10]
[null,null,null,"TU",500,"12.7 mm",106000,160000,150,"NP-500x12.7",12.7,"TU 500-12,7",null,"mm",12.7]
[null,null,null,"TU",500,"25 mm",106000,160000,150,"NP-500x25",25,"TU 500-25",null,"mm",25]
[null,null,null,"TU",500,"38.1 mm",106000,160000,150,"NP-500x38.1",38.1,"TU 500-38,1",null,"mm",38.1]
[null,null,null,"TU",500,"50 mm",106000,160000,150,"NP-500x50",50,"TU 500-50",null,"mm",50]
[null,null,null,"TU",500,"63.5 mm",106000,160000,150,"NP-500x63.5",63.5,"TU 500-63,5",null,"mm",63.5]
[null,null,null,"TU",500,"80 mm",106000,160000,150,"NP-500x80",80,"TU 500-80",null,"mm",80]
[null,null,null,"TU",500,"100 mm",106000,160000,150,"NP-500x100",100,"TU 500-100",null,"mm",100]
[null,null,null,"TU",500,"125 mm",106000,160000,150,"NP-500x125",125,"TU 500-125",null,"mm",125]
[null,null,null,"TU",500,"160 mm",106000,160000,150,"NP-500x160",160,"TU 500-160",null,"mm",160]
[null,null,null,"TU",750,"12.7 mm",106000,160000,150,"NP-750x12.7",12.7,"TU 750-12,7",null,"mm",12.7]
[null,null,null,"TU",750,"25 mm",106000,160000,150,"NP-750x25",25,"TU 750-25",null,"mm",25]
[null,null,null,"TU",750,"38.1 mm",106000,160000,150,"NP-750x38.1",38.1,"TU 750-38,1",null,"mm",38.1]
[null,null,null,"TU",750,"50 mm",106000,160000,150,"NP-750x50",50,"TU 750-50",null,"mm",50]
[null,null,null,"TU",750,"63.5 mm",106000,160000,150,"NP-750x63.5",63.5,"TU 750-63,5",null,"mm",63.5]
[null,null,null,"TU",750,"80 mm",106000,160000,150,"NP-750x80",80,"TU 750-80",null,"mm",80]
[null,null,null,"TU",750,"100 mm",106000,160000,150,"NP-750x100",100,"TU 750-100",null,"mm",100]
[null,null,null,"TU",750,"125 mm",106000,160000,150,"NP-750x125",125,"TU 750-125",null,"mm",125]
[null,null,null,"TU",750,"160 mm",106000,160000,150,"NP-750x160",160,"TU 750-160",null,"mm",160]
[null,null,null,"TU",750,"200 mm",106000,160000,150,"NP-750x200",200,"TU 750-200",null,"mm",200]
[null,null,null,"TU",750,"250 mm",106000,160000,150,"NP-750x250",250,"TU 750-250",null,"mm",250]
[null,null,null,"TU",750,"300 mm",106000,160000,150,"NP-750x300",300,"TU 750-300",null,"mm",300]
[null,null,null,"TU",1500,"25 mm",106000,160000,150,"NP-1500x25",25,"TU 1500-25",null,{"$f":"RIGHT(F34,2)","v":"mm"},{"$f":"VALUE(SUBSTITUTE(LEFT(F34,SEARCH(\" \",F34)-1),\".\",\",\"))","v":25}]
[null,null,null,"TU",1500,"38.1 mm",106000,160000,150,"NP-1500x38.1",38.1,"TU 1500-38,1",null,"mm",38.1]
[null,null,null,"TU",1500,"50 mm",106000,160000,150,"NP-1500x50",50,"TU 1500-50",null,"mm",50]
[null,null,null,"TU",1500,"63.5 mm",106000,160000,150,"NP-1500x63.5",63.5,"TU 1500-63,5",null,"mm",63.5]
[null,null,null,"TU",1500,"80 mm",106000,160000,150,"NP-1500x80",80,"TU 1500-80",null,"mm",80]
[null,null,null,"TU",1500,"100 mm",106000,160000,150,"NP-1500x100",100,"TU 1500-100",null,"mm",100]
[null,null,null,"TU",1500,"125 mm",106000,160000,150,"NP-1500x125",125,"TU 1500-125",null,"mm",125]
[null,null,null,"TU",1500,"160 mm",106000,160000,150,"NP-1500x160",160,"TU 1500-160",null,"mm",160]
[null,null,null,"TU",1500,"200 mm",106000,160000,150,"NP-1500x200",200,"TU 1500-200",null,"mm",200]
[null,null,null,"TU",1500,"250 mm",106000,160000,150,"NP-1500x250",250,"TU 1500-250",null,"mm",250]
[null,null,null,"TU",1500,"300 mm",106000,160000,150,"NP-1500x300",300,"TU 1500-300",null,"mm",300]
[null,null,null,"TU",3000,"25 mm",106000,160000,150,"NP-3000x25",25,"TU 3000-25",null,"mm",25]
[null,null,null,"TU",3000,"38.1 mm",106000,160000,150,"NP-3000x38.1",38.1,"TU 3000-38,1",null,"mm",38.1]
[null,null,null,"TU",3000,"50 mm",106000,160000,150,"NP-3000x50",50,"TU 3000-50",null,"mm",50]
[null,null,null,"TU",3000,"63.5 mm",106000,160000,150,"NP-3000x63.5",63.5,"TU 3000-63,5",null,"mm",63.5]
[null,null,null,"TU",3000,"80 mm",106000,160000,150,"NP-3000x80",80,"TU 3000-80",null,"mm",80]
[null,null,null,"TU",3000,"100 mm",106000,160000,150,"NP-3000x100",100,"TU 3000-100",null,"mm",100]
[null,null,null,"TU",3000,"125 mm",106000,160000,150,"NP-3000x125",125,"TU 3000-125",null,"mm",125]
[null,null,null,"TU",3000,"160 mm",106000,160000,150,"NP-3000x160",160,"TU 3000-160",null,"mm",160]
[null,null,null,"TU",3000,"200 mm",106000,160000,150,"NP-3000x200",200,"TU 3000-200",null,"mm",200]
[null,null,null,"TU",3000,"250 mm",106000,160000,150,"NP-3000x250",250,"TU 3000-250",null,"mm",250]
[null,null,null,"TU",3000,"300 mm",106000,160000,150,"NP-3000x300",300,"TU 3000-300",null,"mm",300]
[null,null,null,"TU",5000,"25 mm",106000,160000,150,"NP-5000x25",25,"TU 5000-25",null,"mm",25]
[null,null,null,"TU",5000,"38.1 mm",106000,160000,150,"NP-5000x38.1",38.1,"TU 5000-38,1",null,"mm",38.1]
[null,null,null,"TU",5000,"50 mm",106000,160000,150,"NP-5000x50",50,"TU 5000-50",null,"mm",50]
[null,null,null,"TU",5000,"63.5 mm",106000,160000,150,"NP-5000x63.5",63.5,"TU 5000-63,5",null,"mm",63.5]
[null,null,null,"TU",5000,"80 mm",106000,160000,150,"NP-5000x80",80,"TU 5000-80",null,"mm",80]
[null,null,null,"TU",5000,"100 mm",106000,160000,150,"NP-5000x100",100,"TU 5000-100",null,"mm",100]
[null,null,null,"TU",5000,"125 mm",106000,160000,150,"NP-5000x125",125,"TU 5000-125",null,"mm",125]
[null,null,null,"TU",5000,"160 mm",106000,160000,150,"NP-5000x160",160,"TU 5000-160",null,"mm",160]
[null,null,null,"TU",5000,"200 mm",106000,160000,150,"NP-5000x200",200,"TU 5000-200",null,"mm",200]
[null,null,null,"TU",5000,"250 mm",106000,160000,150,"NP-5000x250",250,"TU 5000-250",null,"mm",250]
[null,null,null,"TU",5000,"300 mm",106000,160000,150,"NP-5000x300",{"$f":"IF(N66=\"mm\",O66,O66*25.4)","v":300},"TU 5000-300",null,{"$f":"RIGHT(F66,2)","v":"mm"},{"$f":"VALUE(SUBSTITUTE(LEFT(F66,SEARCH(\" \",F66)-1),\".\",\",\"))","v":300}]
[null,null,null,"TU",7500,"25 mm",106000,160000,150,"NP-7500x25",25,"TU 7500-25",null,"mm",25]
[null,null,null,"TU",7500,"38.1 mm",106000,160000,150,"NP-7500x38.1",38.1,"TU 7500-38,1",null,"mm",38.1]
[null,null,null,"TU",7500,"50 mm",106000,160000,150,"NP-7500x50",50,"TU 7500-50",null,"mm",50]
[null,null,null,"TU",7500,"63.5 mm",106000,160000,150,"NP-7500x63.5",63.5,"TU 7500-63,5",null,"mm",63.5]
[null,null,null,"TU",7500,"80 mm",106000,160000,150,"NP-7500x80",80,"TU 7500-80",null,"mm",80]
[null,null,null,"TU",7500,"100 mm",106000,160000,150,"NP-7500x100",100,"TU 7500-100",null,"mm",100]
[null,null,null,"TU",7500,"125 mm",106000,160000,150,"NP-7500x125",125,"TU 7500-125",null,"mm",125]
[null,null,null,"TU",7500,"160 mm",106000,160000,150,"NP-7500x160",160,"TU 7500-160",null,"mm",160]
[null,null,null,"TU",7500,"200 mm",106000,160000,150,"NP-7500x200",200,"TU 7500-200",null,"mm",200]
[null,null,null,"TU",7500,"250 mm",106000,160000,150,"NP-7500x250",250,"TU 7500-250",null,"mm",250]
[null,null,null,"TU",7500,"300 mm",106000,160000,150,"NP-7500x300",300,"TU 7500-300",null,"mm",300]
[null,null,null,"TU",10000,"25 mm",106000,160000,150,"NP-10000x25",25,"TU 10000-25",null,"mm",25]
[null,null,null,"TU",10000,"38.1 mm",106000,160000,150,"NP-10000x38.1",38.1,"TU 10000-38,1",null,"mm",38.1]
[null,null,null,"TU",10000,"50 mm",106000,160000,150,"NP-10000x50",50,"TU 10000-50",null,"mm",50]
[null,null,null,"TU",10000,"63.5 mm",106000,160000,150,"NP-10000x63.5",63.5,"TU 10000-63,5",null,"mm",63.5]
[null,null,null,"TU",10000,"80 mm",106000,160000,150,"NP-10000x80",80,"TU 10000-80",null,"mm",80]
[null,null,null,"TU",10000,"100 mm",106000,156000,150,"NP-10000x100",100,"TU 10000-100",null,"mm",100]
[null,null,null,"TU",10000,"125 mm",106000,157000,150,"NP-10000x125",125,"TU 10000-125",null,"mm",125]
[null,null,null,"TU",10000,"160 mm",106000,158000,150,"NP-10000x160",160,"TU 10000-160",null,"mm",160]
[null,null,null,"TU",10000,"200 mm",106000,160000,150,"NP-10000x200",200,"TU 10000-200",null,"mm",200]
[null,null,null,"TU",10000,"250 mm",106000,160000,150,"NP-10000x250",250,"TU 10000-250",null,"mm",250]
[null,null,null,"TU",10000,"300 mm",106000,160000,150,"NP-10000x300",300,"TU 10000-300",null,"mm",300]
[null,null,null,"K",500,"0.25 in",2000,3060,180,"T2L-500x0.25",6.35,"K 500-6",null,"in",0.25]
[null,null,null,"K",500,"0.50 in",2000,3060,180,"T2L-500x0.50",12.7,"K 500-12,5",null,"in",0.5]
[null,null,null,"K",500,"0.75 in",2000,3060,180,"T2L-500x0.75",19.049999999999997,"K 500-19",null,"in",0.75]
[null,null,null,"K",500,"1.50 in",2000,3060,180,"T2L-500x1.50",38.099999999999994,"K 500-38,1",null,"in",1.5]
[null,null,null,"K",500,"2.50 in",2000,3060,180,"T2L-500x2.50",63.5,"K 500-63,5",null,"in",2.5]
[null,null,null,"K",750,"0.25 in",2000,3060,180,"T2L-750x0.25",6.35,"K 750-6",null,"in",0.25]
[null,null,null,"K",750,"0.50 in",2000,3060,180,"T2L-750x0.50",12.7,"K 750-12,5",null,"in",0.5]
[null,null,null,"K",750,"0.75 in",2000,3060,180,"T2L-750x0.75",19.049999999999997,"K 750-19",null,"in",0.75]
[null,null,null,"K",750,"1.50 in",2000,3060,180,"T2L-750x1.50",38.099999999999994,"K 750-38,1",null,"in",1.5]
[null,null,null,"K",750,"2.50 in",2000,3060,180,"T2L-750x2.50",63.5,"K 750-63,5",null,{"$f":"RIGHT(F98,2)","v":"in"},{"$f":"VALUE(SUBSTITUTE(LEFT(F98,SEARCH(\" \",F98)-1),\".\",\",\"))","v":2.5}]
[null,null,null,"X",170,"7 mm",2000,3060,180,"T3-170x7",7,"X 170-7",null,"mm",7]
[null,null,null,"X",170,"10 mm",2000,3060,180,"T3-170x10",10,"X 170-10",null,"mm",10]
[null,null,null,"X",170,"15 mm",2000,3060,180,"T3-170x15",15,"X 170-15",null,"mm",15]
[null,null,null,"X",170,"19 mm",2000,3060,180,"T3-170x19",19,"X 170-19",null,"mm",19]
[null,null,null,"X",170,"25 mm",2000,3060,180,"T3-170x25",25,"X 170-25",null,"mm",25]
[null,null,null,"X",170,"38 mm",2000,3060,180,"T3-170x38",38,"X 170-38",null,"mm",38]
[null,null,null,"X",170,"50 mm",2000,3060,180,"T3-170x50",50,"X 170-50",null,"mm",50]
[null,null,null,"X",170,"63 mm",2000,3060,180,"T3-170x63",63,"X 170-63",null,"mm",63]
[null,null,null,"X",170,"75 mm",2000,3060,180,"T3-170x75",75,"X 170-75",null,"mm",75]
[null,null,null,"X",170,"80 mm",2000,3060,180,"T3-170x80",80,"X 170-80",null,"mm",80]
[null,null,null,"X",170,"100 mm",2000,3060,180,"T3-170x100",100,"X 170-100",null,"mm",100]
[null,null,null,"X",170,"125 mm",2000,3060,180,"T3-170x125",125,"X 170-125",null,"mm",125]
[null,null,null,"X",320,"7 mm",2000,3060,180,"T3-320x7",7,"X 320-7",null,"mm",7]
[null,null,null,"X",320,"10 mm",2000,3060,180,"T3-320x10",10,"X 320-10",null,"mm",10]
[null,null,null,"X",320,"15 mm",2000,3060,180,"T3-320x15",15,"X 320-15",null,"mm",15]
[null,null,null,"X",320,"19 mm",2000,3060,180,"T3-320x19",19,"X 320-19",null,"mm",19]
[null,null,null,"X",320,"25 mm",2000,3060,180,"T3-320x25",25,"X 320-25",null,"mm",25]
[null,null,null,"X",320,"38 mm",2000,3060,180,"T3-320x38",38,"X 320-38",null,"mm",38]
[null,null,null,"X",320,"50 mm",2000,3060,180,"T3-320x50",50,"X 320-50",null,"mm",50]
[null,null,null,"X",320,"63 mm",2000,3060,180,"T3-320x63",63,"X 320-63",null,"mm",63]
[null,null,null,"X",320,"75 mm",2000,3060,180,"T3-320x75",75,"X 320-75",null,"mm",75]
[null,null,null,"X",320,"80 mm",2000,3060,180,"T3-320x80",80,"X 320-80",null,"mm",80]
[null,null,null,"X",320,"100 mm",2000,3060,180,"T3-320x100",100,"X 320-100",null,"mm",100]
[null,null,null,"X",320,"125 mm",2000,3060,180,"T3-320x125",125,"X 320-125",null,"mm",125]
[null,null,null,"X",350,"10 mm",2000,3060,180,"T3-350x10",10,"X 350-10",null,"mm",10]
[null,null,null,"X",350,"13 mm",2000,3060,180,"T3-350x13",13,"X 350-13",null,"mm",13]
[null,null,null,"X",350,"16 mm",2000,3060,180,"T3-350x16",16,"X 350-16",null,"mm",16]
[null,null,null,"X",350,"19 mm",2000,3060,180,"T3-350x19",19,"X 350-19",null,"mm",19]
[null,null,null,"X",350,"25 mm",2000,3060,180,"T3-350x25",25,"X 350-25",null,"mm",25]
[null,null,null,"X",350,"32 mm",2000,3060,180,"T3-350x32",32,"X 350-32",null,"mm",32]
[null,null,null,"X",350,"38 mm",2000,3060,180,"T3-350x38",38,"X 350-38",null,"mm",38]
[null,null,null,"X",350,"50 mm",2000,3060,180,"T3-350x50",{"$f":"IF(N130=\"mm\",O130,O130*25.4)","v":50},"X 350-50",null,"mm",50]
[null,null,null,"X",350,"63 mm",2000,3060,180,"T3-350x63",63,"X 350-63",null,"mm",63]
[null,null,null,"X",350,"75 mm",2000,3060,180,"T3-350x75",75,"X 350-75",null,{"$f":"RIGHT(F132,2)","v":"mm"},{"$f":"VALUE(SUBSTITUTE(LEFT(F132,SEARCH(\" \",F132)-1),\".\",\",\"))","v":75}]
[null,null,null,"X",350,"80 mm",2000,3060,180,"T3-350x80",80,"X 350-80",null,"mm",80]
[null,null,null,"X",350,"100 mm",2000,3060,180,"T3-350x100",100,"X 350-100",null,"mm",100]
[null,null,null,"X",350,"125 mm",2000,3060,180,"T3-350x125",125,"X 350-125",null,"mm",125]
[null,null,null,"X",500,"10 mm",2000,3060,180,"T3-500x10",10,"X 500-10",null,"mm",10]
[null,null,null,"X",500,"13 mm",2000,3060,180,"T3-500x13",13,"X 500-13",null,"mm",13]
[null,null,null,"X",500,"16 mm",2000,3060,180,"T3-500x16",16,"X 500-16",null,"mm",16]
[null,null,null,"X",500,"19 mm",2000,3060,180,"T3-500x19",19,"X 500-19",null,"mm",19]
[null,null,null,"X",500,"25 mm",2000,3060,180,"T3-500x25",25,"X 500-25",null,"mm",25]
[null,null,null,"X",500,"32 mm",2000,3060,180,"T3-500x32",32,"X 500-32",null,"mm",32]
[null,null,null,"X",500,"38 mm",2000,3060,180,"T3-500x38",38,"X 500-38",null,"mm",38]
[null,null,null,"X",500,"50 mm",2000,3060,180,"T3-500x50",50,"X 500-50",null,"mm",50]
[null,null,null,"X",500,"63 mm",2000,3060,180,"T3-500x63",63,"X 500-63",null,"mm",63]
[null,null,null,"X",500,"75 mm",2000,3060,180,"T3-500x75",75,"X 500-75",null,"mm",75]
[null,null,null,"X",500,"80 mm",2000,3060,180,"T3-500x80",80,"X 500-80",null,"mm",80]
[null,null,null,"X",500,"100 mm",2000,3060,180,"T3-500x100",100,"X 500-100",null,"mm",100]
[null,null,null,"X",500,"125 mm",2000,3060,180,"T3-500x125",125,"X 500-125",null,"mm",125]
[null,null,null,"X",750,"10 mm",2000,3060,180,"T3-750x10",10,"X 750-10",null,"mm",10]
[null,null,null,"X",750,"13 mm",2000,3060,180,"T3-750x13",13,"X 750-13",null,"mm",13]
[null,null,null,"X",750,"16 mm",2000,3060,180,"T3-750x16",16,"X 750-16",null,"mm",16]
[null,null,null,"X",750,"19 mm",2000,3060,180,"T3-750x19",19,"X 750-19",null,"mm",19]
[null,null,null,"X",750,"25 mm",2000,3060,180,"T3-750x25",25,"X 750-25",null,"mm",25]
[null,null,null,"X",750,"32 mm",2000,3060,180,"T3-750x32",32,"X 750-32",null,"mm",32]
[null,null,null,"X",750,"38 mm",2000,3060,180,"T3-750x38",38,"X 750-38",null,"mm",38]
[null,null,null,"X",750,"50 mm",2000,3060,180,"T3-750x50",50,"X 750-50",null,"mm",50]
[null,null,null,"X",750,"63 mm",2000,3060,180,"T3-750x63",63,"X 750-63",null,"mm",63]
[null,null,null,"X",750,"75 mm",2000,3060,180,"T3-750x75",75,"X 750-75",null,"mm",75]
[null,null,null,"X",750,"80 mm",2000,3060,180,"T3-750x80",80,"X 750-80",null,"mm",80]
[null,null,null,"X",750,"100 mm",2000,3060,180,"T3-750x100",100,"X 750-100",null,"mm",100]
[null,null,null,"X",750,"125 mm",2000,3060,180,"T3-750x125",125,"X 750-125",null,"mm",125]
[null,null,null,"X",1000,"13 mm",2000,3060,180,"T3-1000x13",13,"X 1000-13",null,"mm",13]
[null,null,null,"X",1000,"16 mm",2000,3060,180,"T3-1000x16",16,"X 1000-16",null,"mm",16]
[null,null,null,"X",1000,"19 mm",2000,3060,180,"T3-1000x19",19,"X 1000-19",null,"mm",19]
[null,null,null,"X",1000,"25 mm",2000,3060,180,"T3-1000x25",25,"X 1000-25",null,"mm",25]
[null,null,null,"X",1000,"32 mm",2000,3060,180,"T3-1000x32",32,"X 1000-32",null,"mm",32]
[null,null,null,"X",1000,"38 mm",2000,3060,180,"T3-1000x38",38,"X 1000-38",null,"mm",38]
[null,null,null,"X",1000,"50 mm",2000,3060,180,"T3-1000x50",50,"X 1000-50",null,"mm",50]
[null,null,null,"X",1000,"63 mm",2000,3060,180,"T3-1000x63",63,"X 1000-63",null,"mm",63]
[null,null,null,"X",1000,"75 mm",2000,3060,180,"T3-1000x75",75,"X 1000-75",null,"mm",75]
[null,null,null,"X",1000,"80 mm",2000,3060,180,"T3-1000x80",80,"X 1000-80",null,"mm",80]
[null,null,null,"X",1000,"100 mm",2000,3060,180,"T3-1000x100",100,"X 1000-100",null,"mm",100]
[null,null,null,"X",1000,"125 mm",2000,3060,180,"T3-1000x125",125,"X 1000-125",null,"mm",125]
[null,null,null,"X",1500,"13 mm",2000,3060,180,"T3-1500x13",13,"X 1500-13",null,"mm",13]
[null,null,null,"X",1500,"16 mm",2000,3060,180,"T3-1500x16",16,"X 1500-16",null,"mm",16]
[null,null,null,"X",1500,"19 mm",2000,3060,180,"T3-1500x19",19,"X 1500-19",null,"mm",19]
[null,null,null,"X",1500,"25 mm",2000,3060,180,"T3-1500x25",25,"X 1500-25",null,"mm",25]
[null,null,null,"X",1500,"32 mm",2000,3060,180,"T3-1500x32",32,"X 1500-32",null,"mm",32]
[null,null,null,"X",1500,"38 mm",2000,3060,180,"T3-1500x38",38,"X 1500-38",null,"mm",38]
[null,null,null,"X",1500,"50 mm",2000,3060,180,"T3-1500x50",50,"X 1500-50",null,"mm",50]
[null,null,null,"X",1500,"63 mm",2000,3060,180,"T3-1500x63",63,"X 1500-63",null,"mm",63]
[null,null,null,"X",1500,"75 mm",2000,3060,180,"T3-1500x75",75,"X 1500-75",null,"mm",75]
[null,null,null,"X",1500,"80 mm",2000,3060,180,"T3-1500x80",80,"X 1500-80",null,"mm",80]
[null,null,null,"X",1500,"100 mm",2000,3060,180,"T3-1500x100",100,"X 1500-100",null,"mm",100]
[null,null,null,"X",1500,"125 mm",2000,3060,180,"T3-1500x125",125,"X 1500-125",null,"mm",125]
[null,null,null,"X",2400,"16 mm",2000,3060,180,"T3-2400x16",16,"X 2400-16",null,"mm",16]
[null,null,null,"X",2400,"19 mm",2000,3060,180,"T3-2400x19",19,"X 2400-19",null,"mm",19]
[null,null,null,"X",2400,"25 mm",2000,3060,180,"T3-2400x25",25,"X 2400-25",null,"mm",25]
[null,null,null,"X",2400,"32 mm",2000,3060,180,"T3-2400x32",32,"X 2400-32",null,"mm",32]
[null,null,null,"X",2400,"38 mm",2000,3060,180,"T3-2400x38",38,"X 2400-38",null,"mm",38]
[null,null,null,"X",2400,"50 mm",2000,3060,180,"T3-2400x50",50,"X 2400-50",null,"mm",50]
[null,null,null,"X",2400,"63 mm",2000,3060,180,"T3-2400x63",63,"X 2400-63",null,"mm",63]
[null,null,null,"X",2400,"75 mm",2000,3060,180,"T3-2400x75",75,"X 2400-75",null,"mm",75]
[null,null,null,"X",2400,"80 mm",2000,3060,180,"T3-2400x80",{"$f":"IF(N194=\"mm\",O194,O194*25.4)","v":80},"X 2400-80",null,"mm",80]
[null,null,null,"X",2400,"100 mm",2000,3060,180,"T3-2400x100",100,"X 2400-100",null,"mm",100]
[null,null,null,"X",2400,"125 mm",2000,3060,180,"T3-2400x125",125,"X 2400-125",null,{"$f":"RIGHT(F196,2)","v":"mm"},{"$f":"VALUE(SUBSTITUTE(LEFT(F196,SEARCH(\" \",F196)-1),\".\",\",\"))","v":125}]
[null,null,null,"X",4200,"16 mm",2000,3060,180,"T3-4200x16",16,"X 4200-16",null,"mm",16]
[null,null,null,"X",4200,"19 mm",2000,3060,180,"T3-4200x19",19,"X 4200-19",null,"mm",19]
[null,null,null,"X",4200,"25 mm",2000,3060,180,"T3-4200x25",25,"X 4200-25",null,"mm",25]
[null,null,null,"X",4200,"32 mm",2000,3060,180,"T3-4200x32",32,"X 4200-32",null,"mm",32]
[null,null,null,"X",4200,"38 mm",2000,3060,180,"T3-4200x38",38,"X 4200-38",null,"mm",38]
[null,null,null,"X",4200,"50 mm",2000,3060,180,"T3-4200x50",50,"X 4200-50",null,"mm",50]
[null,null,null,"X",4200,"63 mm",2000,3060,180,"T3-4200x63",63,"X 4200-63",null,"mm",63]
[null,null,null,"X",4200,"75 mm",2000,3060,180,"T3-4200x75",75,"X 4200-75",null,"mm",75]
[null,null,null,"X",4200,"80 mm",2000,3060,180,"T3-4200x80",80,"X 4200-80",null,"mm",80]
[null,null,null,"X",4200,"100 mm",2000,3060,180,"T3-4200x100",100,"X 4200-100",null,"mm",100]
[null,null,null,"X",4200,"125 mm",2000,3060,180,"T3-4200x125",125,"X 4200-125",null,"mm",125]
[null,null,null,"X",6600,"16 mm",2000,3060,180,"T3-6600x16",16,"X 6600-16",null,"mm",16]
[null,null,null,"X",6600,"19 mm",2000,3060,180,"T3-6600x19",19,"X 6600-19",null,"mm",19]
[null,null,null,"X",6600,"25 mm",2000,3060,180,"T3-6600x25",25,"X 6600-25",null,"mm",25]
[null,null,null,"X",6600,"32 mm",2000,3060,180,"T3-6600x32",32,"X 6600-32",null,"mm",32]
[null,null,null,"X",6600,"38 mm",2000,3060,180,"T3-6600x38",38,"X 6600-38",null,"mm",38]
[null,null,null,"X",6600,"50 mm",2000,3060,180,"T3-6600x50",50,"X 6600-50",null,"mm",50]
[null,null,null,"X",6600,"63 mm",2000,3060,180,"T3-6600x63",63,"X 6600-63",null,"mm",63]
[null,null,null,"X",6600,"75 mm",2000,3060,180,"T3-6600x75",75,"X 6600-75",null,"mm",75]
[null,null,null,"X",6600,"80 mm",2000,3060,180,"T3-6600x80",80,"X 6600-80",null,"mm",80]
[null,null,null,"X",6600,"100 mm",2000,3060,180,"T3-6600x100",100,"X 6600-100",null,"mm",100]
[null,null,null,"X",6600,"125 mm",2000,3060,180,"T3-6600x125",125,"X 6600-125",null,"mm",125]
[null,null,null,"X",9500,"19 mm",2000,3060,180,"T3-9500x19",19,"X 9500-19",null,"mm",19]
[null,null,null,"X",9500,"25 mm",2000,3060,180,"T3-9500x25",25,"X 9500-25",null,"mm",25]
[null,null,null,"X",9500,"32 mm",2000,3060,180,"T3-9500x32",32,"X 9500-32",null,"mm",32]
[null,null,null,"X",9500,"38 mm",2000,3060,180,"T3-9500x38",38,"X 9500-38",null,"mm",38]
[null,null,null,"X",9500,"50 mm",2000,3060,180,"T3-9500x50",50,"X 9500-50",null,"mm",50]
[null,null,null,"X",9500,"63 mm",2000,3060,180,"T3-9500x63",63,"X 9500-63",null,"mm",63]
[null,null,null,"X",9500,"75 mm",2000,3060,180,"T3-9500x75",75,"X 9500-75",null,"mm",75]
[null,null,null,"X",9500,"80 mm",2000,3060,180,"T3-9500x80",80,"X 9500-80",null,"mm",80]
[null,null,null,"X",9500,"100 mm",2000,3060,180,"T3-9500x100",100,"X 9500-100",null,"mm",100]
[null,null,null,"X",9500,"125 mm",2000,3060,180,"T3-9500x125",125,"X 9500-125",null,"mm",125]
[null,null,null,"X",20000,"19 mm",2000,3060,180,"T3-20000x19",19,"X 20000-19",null,"mm",19]
[null,null,null,"X",20000,"25 mm",2000,3060,180,"T3-20000x25",25,"X 20000-25",null,"mm",25]
[null,null,null,"X",20000,"32 mm",2000,3060,180,"T3-20000x32",32,"X 20000-32",null,"mm",32]
[null,null,null,"X",20000,"38 mm",2000,3060,180,"T3-20000x38",38,"X 20000-38",null,"mm",38]
[null,null,null,"X",20000,"50 mm",2000,3060,180,"T3-20000x50",50,"X 20000-50",null,"mm",50]
[null,null,null,"X",20000,"63 mm",2000,3060,180,"T3-20000x63",63,"X 20000-63",null,"mm",63]
[null,null,null,"X",20000,"75 mm",2000,3060,180,"T3-20000x75",75,"X 20000-75",null,"mm",75]
[null,null,null,"X",20000,"80 mm",2000,3060,180,"T3-20000x80",80,"X 20000-80",null,"mm",80]
[null,null,null,"X",20000,"100 mm",2000,3060,180,"T3-20000x100",100,"X 20000-100",null,"mm",100]
[null,null,null,"X",20000,"125 mm",2000,3060,180,"T3-20000x125",125,"X 20000-125",null,"mm",125]
[null,null,null,"TX",750,"12.7 mm",24000,39300,150,"T4-750x12.7",12.7,"TX 750-13",null,"mm",12.7]
[null,null,null,"TX",750,"25 mm",24000,39300,150,"T4-750x25",25,"TX 750-25",null,"mm",25]
[null,null,null,"TX",750,"38.1 mm",24000,39300,150,"T4-750x38.1",38.1,"TX 750-38",null,"mm",38.1]
[null,null,null,"TX",750,"50 mm",24000,39300,150,"T4-750x50",50,"TX 750-50",null,"mm",50]
[null,null,null,"TX",750,"63.5 mm",24000,39300,150,"T4-750x63.5",63.5,"TX 750-63",null,"mm",63.5]
[null,null,null,"TX",750,"75 mm",24000,39300,150,"T4-750x75",75,"TX 750-75",null,"mm",75]
[null,null,null,"TX",750,"80 mm",24000,39300,150,"T4-750x80",80,"TX 750-80",null,"mm",80]
[null,null,null,"TX",750,"100 mm",24000,39300,150,"T4-750x100",100,"TX 750-100",null,"mm",100]
[null,null,null,"TX",750,"125 mm",24000,39300,150,"T4-750x125",125,"TX 750-125",null,"mm",125]
[null,null,null,"TX",750,"150 mm",24000,39300,150,"T4-750x150",150,"TX 750-150",null,"mm",150]
[null,null,null,"TX",750,"160 mm",24000,39300,150,"T4-750x160",160,"TX 750-160",null,"mm",160]
[null,null,null,"TX",750,"175 mm",24000,39300,150,"T4-750x175",175,"TX 750-175",null,"mm",175]
[null,null,null,"TX",750,"200 mm",24000,39300,150,"T4-750x200",200,"TX 750-200",null,"mm",200]
[null,null,null,"TX",1000,"12.7 mm",24000,39300,150,"T4-1000x12.7",12.7,"TX 1000-13",null,"mm",12.7]
[null,null,null,"TX",1000,"25 mm",24000,39300,150,"T4-1000x25",25,"TX 1000-25",null,"mm",25]
[null,null,null,"TX",1000,"38.1 mm",24000,39300,150,"T4-1000x38.1",38.1,"TX 1000-38",null,"mm",38.1]
[null,null,null,"TX",1000,"50 mm",24000,39300,150,"T4-1000x50",50,"TX 1000-50",null,"mm",50]
[null,null,null,"TX",1000,"63.5 mm",24000,39300,150,"T4-1000x63.5",63.5,"TX 1000-63",null,"mm",63.5]
[null,null,null,"TX",1000,"75 mm",24000,39300,150,"T4-1000x75",75,"TX 1000-75",null,"mm",75]
[null,null,null,"TX",1000,"80 mm",24000,39300,150,"T4-1000x80",{"$f":"IF(N258=\"mm\",O258,O258*25.4)","v":80},"TX 1000-80",null,"mm",80]
[null,null,null,"TX",1000,"100 mm",24000,39300,150,"T4-1000x100",100,"TX 1000-100",null,"mm",100]
[null,null,null,"TX",1000,"125 mm",24000,39300,150,"T4-1000x125",125,"TX 1000-125",null,{"$f":"RIGHT(F260,2)","v":"mm"},{"$f":"VALUE(SUBSTITUTE(LEFT(F260,SEARCH(\" \",F260)-1),\".\",\",\"))","v":125}]
[null,null,null,"TX",1000,"150 mm",24000,39300,150,"T4-1000x150",150,"TX 1000-150",null,"mm",150]
[null,null,null,"TX",1000,"160 mm",24000,39300,150,"T4-1000x160",160,"TX 1000-160",null,"mm",160]
[null,null,null,"TX",1000,"175 mm",24000,39300,150,"T4-1000x175",175,"TX 1000-175",null,"mm",175]
[null,null,null,"TX",1000,"200 mm",24000,39300,150,"T4-1000x200",200,"TX 1000-200",null,"mm",200]
[null,null,null,"TX",1000,"250 mm",24000,39300,150,"T4-1000x250",250,"TX 1000-250",null,"mm",250]
[null,null,null,"TX",1000,"300 mm",24000,39300,150,"T4-1000x300",300,"TX 1000-300",null,"mm",300]
[null,null,null,"TX",1500,"12.7 mm",24000,39300,150,"T4-1500x12.7",12.7,"TX 1500-13",null,"mm",12.7]
[null,null,null,"TX",1500,"25 mm",24000,39300,150,"T4-1500x25",25,"TX 1500-25",null,"mm",25]
[null,null,null,"TX",1500,"38.1 mm",24000,39300,150,"T4-1500x38.1",38.1,"TX 1500-38",null,"mm",38.1]
[null,null,null,"TX",1500,"50 mm",24000,39300,150,"T4-1500x50",50,"TX 1500-50",null,"mm",50]
[null,null,null,"TX",1500,"63.5 mm",24000,39300,150,"T4-1500x63.5",63.5,"TX 1500-63",null,"mm",63.5]
[null,null,null,"TX",1500,"75 mm",24000,39300,150,"T4-1500x75",75,"TX 1500-75",null,"mm",75]
[null,null,null,"TX",1500,"80 mm",24000,39300,150,"T4-1500x80",80,"TX 1500-80",null,"mm",80]
[null,null,null,"TX",1500,"100 mm",24000,39300,150,"T4-1500x100",100,"TX 1500-100",null,"mm",100]
[null,null,null,"TX",1500,"125 mm",24000,39300,150,"T4-1500x125",125,"TX 1500-125",null,"mm",125]
[null,null,null,"TX",1500,"150 mm",24000,39300,150,"T4-1500x150",150,"TX 1500-150",null,"mm",150]
[null,null,null,"TX",1500,"160 mm",24000,39300,150,"T4-1500x160",160,"TX 1500-160",null,"mm",160]
[null,null,null,"TX",1500,"175 mm",24000,39300,150,"T4-1500x175",175,"TX 1500-175",null,"mm",175]
[null,null,null,"TX",1500,"200 mm",24000,39300,150,"T4-1500x200",200,"TX 1500-200",null,"mm",200]
[null,null,null,"TX",1500,"250 mm",24000,39300,150,"T4-1500x250",250,"TX 1500-250",null,"mm",250]
[null,null,null,"TX",1500,"300 mm",24000,39300,150,"T4-1500x300",300,"TX 1500-300",null,"mm",300]
[null,null,null,"TX",2400,"25 mm",24000,39300,150,"T4-2400x25",25,"TX 2400-25",null,"mm",25]
[null,null,null,"TX",2400,"38.1 mm",24000,39300,150,"T4-2400x38.1",38.1,"TX 2400-38",null,"mm",38.1]
[null,null,null,"TX",2400,"50 mm",24000,39300,150,"T4-2400x50",50,"TX 2400-50",null,"mm",50]
[null,null,null,"TX",2400,"63.5 mm",24000,39300,150,"T4-2400x63.5",63.5,"TX 2400-63",null,"mm",63.5]
[null,null,null,"TX",2400,"75 mm",24000,39300,150,"T4-2400x75",75,"TX 2400-75",null,"mm",75]
[null,null,null,"TX",2400,"80 mm",24000,39300,150,"T4-2400x80",80,"TX 2400-80",null,"mm",80]
[null,null,null,"TX",2400,"100 mm",24000,39300,150,"T4-2400x100",100,"TX 2400-100",null,"mm",100]
[null,null,null,"TX",2400,"125 mm",24000,39300,150,"T4-2400x125",125,"TX 2400-125",null,"mm",125]
[null,null,null,"TX",2400,"150 mm",24000,39300,150,"T4-2400x150",150,"TX 2400-150",null,"mm",150]
[null,null,null,"TX",2400,"160 mm",24000,39300,150,"T4-2400x160",160,"TX 2400-160",null,"mm",160]
[null,null,null,"TX",2400,"175 mm",24000,39300,150,"T4-2400x175",175,"TX 2400-175",null,"mm",175]
[null,null,null,"TX",2400,"200 mm",24000,39300,150,"T4-2400x200",200,"TX 2400-200",null,"mm",200]
[null,null,null,"TX",2400,"250 mm",24000,39300,150,"T4-2400x250",250,"TX 2400-250",null,"mm",250]
[null,null,null,"TX",2400,"300 mm",24000,39300,150,"T4-2400x300",300,"TX 2400-300",null,"mm",300]
[null,null,null,"TX",4200,"25 mm",24000,39300,150,"T4-4200x25",25,"TX 4200-25",null,"mm",25]
[null,null,null,"TX",4200,"38.1 mm",24000,39300,150,"T4-4200x38.1",38.1,"TX 4200-38",null,"mm",38.1]
[null,null,null,"TX",4200,"50 mm",24000,39300,150,"T4-4200x50",50,"TX 4200-50",null,"mm",50]
[null,null,null,"TX",4200,"63.5 mm",24000,39300,150,"T4-4200x63.5",63.5,"TX 4200-63",null,"mm",63.5]
[null,null,null,"TX",4200,"75 mm",24000,39300,150,"T4-4200x75",75,"TX 4200-75",null,"mm",75]
[null,null,null,"TX",4200,"80 mm",24000,39300,150,"T4-4200x80",80,"TX 4200-80",null,"mm",80]
[null,null,null,"TX",4200,"100 mm",24000,39300,150,"T4-4200x100",100,"TX 4200-100",null,"mm",100]
[null,null,null,"TX",4200,"125 mm",24000,39300,150,"T4-4200x125",125,"TX 4200-125",null,"mm",125]
[null,null,null,"TX",4200,"150 mm",24000,39300,150,"T4-4200x150",150,"TX 4200-150",null,"mm",150]
[null,null,null,"TX",4200,"160 mm",24000,39300,150,"T4-4200x160",160,"TX 4200-160",null,"mm",160]
[null,null,null,"TX",4200,"175 mm",24000,39300,150,"T4-4200x175",175,"TX 4200-175",null,"mm",175]
[null,null,null,"TX",4200,"200 mm",24000,39300,150,"T4-4200x200",200,"TX 4200-200",null,"mm",200]
[null,null,null,"TX",4200,"250 mm",24000,39300,150,"T4-4200x250",250,"TX 4200-250",null,"mm",250]
[null,null,null,"TX",4200,"300 mm",24000,39300,150,"T4-4200x300",300,"TX 4200-300",null,"mm",300]
[null,null,null,"TX",6600,"25 mm",24000,39300,150,"T4-6600x25",25,"TX 6600-25",null,"mm",25]
[null,null,null,"TX",6600,"38.1 mm",24000,39300,150,"T4-6600x38.1",38.1,"TX 6600-38",null,"mm",38.1]
[null,null,null,"TX",6600,"50 mm",24000,39300,150,"T4-6600x50",50,"TX 6600-50",null,"mm",50]
[null,null,null,"TX",6600,"63.5 mm",24000,39300,150,"T4-6600x63.5",63.5,"TX 6600-63",null,"mm",63.5]
[null,null,null,"TX",6600,"75 mm",24000,39300,150,"T4-6600x75",75,"TX 6600-75",null,"mm",75]
[null,null,null,"TX",6600,"80 mm",24000,39300,150,"T4-6600x80",80,"TX 6600-80",null,"mm",80]
[null,null,null,"TX",6600,"100 mm",24000,39300,150,"T4-6600x100",100,"TX 6600-100",null,"mm",100]
[null,null,null,"TX",6600,"125 mm",24000,39300,150,"T4-6600x125",125,"TX 6600-125",null,"mm",125]
[null,null,null,"TX",6600,"150 mm",24000,39300,150,"T4-6600x150",150,"TX 6600-150",null,"mm",150]
[null,null,null,"TX",6600,"160 mm",24000,39300,150,"T4-6600x160",160,"TX 6600-160",null,"mm",160]
[null,null,null,"TX",6600,"175 mm",24000,39300,150,"T4-6600x175",175,"TX 6600-175",null,"mm",175]
[null,null,null,"TX",6600,"200 mm",24000,39300,150,"T4-6600x200",200,"TX 6600-200",null,"mm",200]
[null,null,null,"TX",6600,"250 mm",24000,39300,150,"T4-6600x250",{"$f":"IF(N322=\"mm\",O322,O322*25.4)","v":250},"TX 6600-250",null,"mm",250]
[null,null,null,"TX",6600,"300 mm",24000,39300,150,"T4-6600x300",300,"TX 6600-300",null,"mm",300]
[null,null,null,"TX",9500,"25 mm",24000,39300,150,"T4-9500x25",25,"TX 9500-25",null,{"$f":"RIGHT(F324,2)","v":"mm"},{"$f":"VALUE(SUBSTITUTE(LEFT(F324,SEARCH(\" \",F324)-1),\".\",\",\"))","v":25}]
[null,null,null,"TX",9500,"38.1 mm",24000,39300,150,"T4-9500x38.1",38.1,"TX 9500-38",null,"mm",38.1]
[null,null,null,"TX",9500,"50 mm",24000,39300,150,"T4-9500x50",50,"TX 9500-50",null,"mm",50]
[null,null,null,"TX",9500,"63.5 mm",24000,39300,150,"T4-9500x63.5",63.5,"TX 9500-63",null,"mm",63.5]
[null,null,null,"TX",9500,"75 mm",24000,39300,150,"T4-9500x75",75,"TX 9500-75",null,"mm",75]
[null,null,null,"TX",9500,"80 mm",24000,39300,150,"T4-9500x80",80,"TX 9500-80",null,"mm",80]
[null,null,null,"TX",9500,"100 mm",24000,39300,150,"T4-9500x100",100,"TX 9500-100",null,"mm",100]
[null,null,null,"TX",9500,"125 mm",24000,39300,150,"T4-9500x125",125,"TX 9500-125",null,"mm",125]
[null,null,null,"TX",9500,"150 mm",24000,39300,150,"T4-9500x150",150,"TX 9500-150",null,"mm",150]
[null,null,null,"TX",9500,"160 mm",24000,39300,150,"T4-9500x160",160,"TX 9500-160",null,"mm",160]
[null,null,null,"TX",9500,"175 mm",24000,39300,150,"T4-9500x175",175,"TX 9500-175",null,"mm",175]
[null,null,null,"TX",9500,"200 mm",24000,39300,150,"T4-9500x200",200,"TX 9500-200",null,"mm",200]
[null,null,null,"TX",9500,"250 mm",24000,39300,150,"T4-9500x250",250,"TX 9500-250",null,"mm",250]
[null,null,null,"TX",9500,"300 mm",24000,39300,150,"T4-9500x300",300,"TX 9500-300",null,"mm",300]
[null,null,null,"TX",20000,"25 mm",24000,39300,150,"T4-20000x25",25,"TX 20000-25",null,"mm",25]
[null,null,null,"TX",20000,"38.1 mm",24000,39300,150,"T4-20000x38.1",38.1,"TX 20000-38",null,"mm",38.1]
[null,null,null,"TX",20000,"50 mm",24000,39300,150,"T4-20000x50",50,"TX 20000-50",null,"mm",50]
[null,null,null,"TX",20000,"63.5 mm",24000,39300,150,"T4-20000x63.5",63.5,"TX 20000-63",null,"mm",63.5]
[null,null,null,"TX",20000,"80 mm",24000,39300,150,"T4-20000x80",80,"TX 20000-80",null,"mm",80]
[null,null,null,"TX",20000,"100 mm",24000,39300,150,"T4-20000x100",100,"TX 20000-100",null,"mm",100]
[null,null,null,"TX",20000,"125 mm",24000,39300,150,"T4-20000x125",125,"TX 20000-125",null,"mm",125]
[null,null,null,"TX",20000,"160 mm",24000,39300,150,"T4-20000x160",160,"TX 20000-160",null,"mm",160]
[null,null,null,"TX",20000,"200 mm",24000,39300,150,"T4-20000x200",200,"TX 20000-200",null,"mm",200]
[null,null,null,"TX",20000,"250 mm",24000,39300,150,"T4-20000x250",250,"TX 20000-250",null,"mm",250]
[null,null,null,"TX",20000,"300 mm",24000,39300,150,"T4-20000x300",300,"TX 20000-300",null,"mm",300]
[null,null,null,"TL",750,"12.5 mm",106000,160000,150,"NPL-750x12.5",12.5,"TL 750-12,5",null,"mm",12.5]
[null,null,null,"TL",750,"25 mm",106000,160000,150,"NPL-750x25",25,"TL 750-25",null,"mm",25]
[null,null,null,"TL",750,"37.5 mm",106000,160000,150,"NPL-750x37.5",37.5,"TL 750-37,5",null,"mm",37.5]
[null,null,null,"TL",750,"50 mm",106000,160000,150,"NPL-750x50",50,"TL 750-50",null,"mm",50]
[null,null,null,"TL",750,"62.5 mm",106000,160000,150,"NPL-750x62.5",62.5,"TL 750-62,5",null,"mm",62.5]
[null,null,null,"TL",750,"75 mm",106000,160000,150,"NPL-750x75",75,"TL 750-75",null,"mm",75]
[null,null,null,"TL",750,"80 mm",106000,160000,150,"NPL-750x80",80,"TL 750-80",null,"mm",80]
[null,null,null,"TL",750,"87.5 mm",106000,160000,150,"NPL-750x87.5",87.5,"TL 750-87,5",null,"mm",87.5]
[null,null,null,"TL",750,"100 mm",106000,160000,150,"NPL-750x100",100,"TL 750-100",null,"mm",100]
[null,null,null,"TL",750,"112.5 mm",106000,160000,150,"NPL-750x112.5",112.5,"TL 750-112,5",null,"mm",112.5]
[null,null,null,"TL",750,"125 mm",106000,160000,150,"NPL-750x125",125,"TL 750-125",null,"mm",125]
[null,null,null,"TL",750,"137.5 mm",106000,160000,150,"NPL-750x137.5",137.5,"TL 750-137,5",null,"mm",137.5]
[null,null,null,"TL",750,"150 mm",106000,160000,150,"NPL-750x150",150,"TL 750-150",null,"mm",150]
[null,null,null,"TL",750,"160 mm",106000,160000,150,"NPL-750x160",160,"TL 750-160",null,"mm",160]
[null,null,null,"TL",750,"175 mm",106000,160000,150,"NPL-750x175",175,"TL 750-175",null,"mm",175]
[null,null,null,"TL",750,"200 mm",106000,160000,150,"NPL-750x200",200,"TL 750-200",null,"mm",200]
[null,null,null,"TL",750,"225 mm",106000,160000,150,"NPL-750x225",225,"TL 750-225",null,"mm",225]
[null,null,null,"TL",750,"250 mm",106000,160000,150,"NPL-750x250",250,"TL 750-250",null,"mm",250]
[null,null,null,"TL",1500,"12.5 mm",106000,160000,150,"NPL-1500x12.5",12.5,"TL 1500-12,5",null,"mm",12.5]
[null,null,null,"TL",1500,"25 mm",106000,160000,150,"NPL-1500x25",25,"TL 1500-25",null,"mm",25]
[null,null,null,"TL",1500,"37.5 mm",106000,160000,150,"NPL-1500x37.5",37.5,"TL 1500-37,5",null,"mm",37.5]
[null,null,null,"TL",1500,"50 mm",106000,160000,150,"NPL-1500x50",50,"TL 1500-50",null,"mm",50]
[null,null,null,"TL",1500,"62.5 mm",106000,160000,150,"NPL-1500x62.5",62.5,"TL 1500-62,5",null,"mm",62.5]
[null,null,null,"TL",1500,"75 mm",106000,160000,150,"NPL-1500x75",75,"TL 1500-75",null,"mm",75]
[null,null,null,"TL",1500,"80 mm",106000,160000,150,"NPL-1500x80",80,"TL 1500-80",null,"mm",80]
[null,null,null,"TL",1500,"87.5 mm",106000,160000,150,"NPL-1500x87.5",87.5,"TL 1500-87,5",null,"mm",87.5]
[null,null,null,"TL",1500,"100 mm",106000,160000,150,"NPL-1500x100",100,"TL 1500-100",null,"mm",100]
[null,null,null,"TL",1500,"112.5 mm",106000,160000,150,"NPL-1500x112.5",112.5,"TL 1500-112,5",null,"mm",112.5]
[null,null,null,"TL",1500,"125 mm",106000,160000,150,"NPL-1500x125",125,"TL 1500-125",null,"mm",125]
[null,null,null,"TL",1500,"137.5 mm",106000,160000,150,"NPL-1500x137.5",137.5,"TL 1500-137,5",null,"mm",137.5]
[null,null,null,"TL",1500,"150 mm",106000,160000,150,"NPL-1500x150",150,"TL 1500-150",null,"mm",150]
[null,null,null,"TL",1500,"160 mm",106000,160000,150,"NPL-1500x160",160,"TL 1500-160",null,"mm",160]
[null,null,null,"TL",1500,"175 mm",106000,160000,150,"NPL-1500x175",175,"TL 1500-175",null,"mm",175]
[null,null,null,"TL",1500,"200 mm",106000,160000,150,"NPL-1500x200",200,"TL 1500-200",null,"mm",200]
[null,null,null,"TL",1500,"225 mm",106000,160000,150,"NPL-1500x225",225,"TL 1500-225",null,"mm",225]
[null,null,null,"TL",1500,"250 mm",106000,160000,150,"NPL-1500x250",250,"TL 1500-250",null,"mm",250]
[null,null,null,"TL",3000,"12.5 mm",106000,160000,150,"NPL-3000x12.5",12.5,"TL 3000-12,5",null,"mm",12.5]
[null,null,null,"TL",3000,"25 mm",106000,160000,150,"NPL-3000x25",{"$f":"IF(N386=\"mm\",O386,O386*25.4)","v":25},"TL 3000-25",null,"mm",25]
[null,null,null,"TL",3000,"37.5 mm",106000,160000,150,"NPL-3000x37.5",37.5,"TL 3000-37,5",null,"mm",37.5]
[null,null,null,"TL",3000,"50 mm",106000,160000,150,"NPL-3000x50",50,"TL 3000-50",null,{"$f":"RIGHT(F388,2)","v":"mm"},{"$f":"VALUE(SUBSTITUTE(LEFT(F388,SEARCH(\" \",F388)-1),\".\",\",\"))","v":50}]
[null,null,null,"TL",3000,"62.5 mm",106000,160000,150,"NPL-3000x62.5",62.5,"TL 3000-62,5",null,"mm",62.5]
[null,null,null,"TL",3000,"75 mm",106000,160000,150,"NPL-3000x75",75,"TL 3000-75",null,"mm",75]
[null,null,null,"TL",3000,"80 mm",106000,160000,150,"NPL-3000x80",80,"TL 3000-80",null,"mm",80]
[null,null,null,"TL",3000,"87.5 mm",106000,160000,150,"NPL-3000x87.5",87.5,"TL 3000-87,5",null,"mm",87.5]
[null,null,null,"TL",3000,"100 mm",106000,160000,150,"NPL-3000x100",100,"TL 3000-100",null,"mm",100]
[null,null,null,"TL",3000,"112.5 mm",106000,160000,150,"NPL-3000x112.5",112.5,"TL 3000-112,5",null,"mm",112.5]
[null,null,null,"TL",3000,"125 mm",106000,160000,150,"NPL-3000x125",125,"TL 3000-125",null,"mm",125]
[null,null,null,"TL",3000,"137.5 mm",106000,160000,150,"NPL-3000x137.5",137.5,"TL 3000-137,5",null,"mm",137.5]
[null,null,null,"TL",3000,"150 mm",106000,160000,150,"NPL-3000x150",150,"TL 3000-150",null,"mm",150]
[null,null,null,"TL",3000,"160 mm",106000,160000,150,"NPL-3000x160",160,"TL 3000-160",null,"mm",160]
[null,null,null,"TL",3000,"175 mm",106000,160000,150,"NPL-3000x175",175,"TL 3000-175",null,"mm",175]
[null,null,null,"TL",3000,"200 mm",106000,160000,150,"NPL-3000x200",200,"TL 3000-200",null,"mm",200]
[null,null,null,"TL",3000,"225 mm",106000,160000,150,"NPL-3000x225",225,"TL 3000-225",null,"mm",225]
[null,null,null,"TL",3000,"250 mm",106000,160000,150,"NPL-3000x250",250,"TL 3000-250",null,"mm",250]
[null,null,null,"TL",5000,"25 mm",106000,160000,150,"NPL-5000x25",25,"TL 5000-25",null,"mm",25]
[null,null,null,"TL",5000,"37.5 mm",106000,160000,150,"NPL-5000x37.5",37.5,"TL 5000-37,5",null,"mm",37.5]
[null,null,null,"TL",5000,"50 mm",106000,160000,150,"NPL-5000x50",50,"TL 5000-50",null,"mm",50]
[null,null,null,"TL",5000,"62.5 mm",106000,160000,150,"NPL-5000x62.5",62.5,"TL 5000-62,5",null,"mm",62.5]
[null,null,null,"TL",5000,"75 mm",106000,160000,150,"NPL-5000x75",75,"TL 5000-75",null,"mm",75]
[null,null,null,"TL",5000,"80 mm",106000,160000,150,"NPL-5000x80",80,"TL 5000-80",null,"mm",80]
[null,null,null,"TL",5000,"87.5 mm",106000,160000,150,"NPL-5000x87.5",87.5,"TL 5000-87,5",null,"mm",87.5]
[null,null,null,"TL",5000,"100 mm",106000,160000,150,"NPL-5000x100",100,"TL 5000-100",null,"mm",100]
[null,null,null,"TL",5000,"112.5 mm",106000,160000,150,"NPL-5000x112.5",112.5,"TL 5000-112,5",null,"mm",112.5]
[null,null,null,"TL",5000,"125 mm",106000,160000,150,"NPL-5000x125",125,"TL 5000-125",null,"mm",125]
[null,null,null,"TL",5000,"137.5 mm",106000,160000,150,"NPL-5000x137.5",137.5,"TL 5000-137,5",null,"mm",137.5]
[null,null,null,"TL",5000,"150 mm",106000,160000,150,"NPL-5000x150",150,"TL 5000-150",null,"mm",150]
[null,null,null,"TL",5000,"160 mm",106000,160000,150,"NPL-5000x160",160,"TL 5000-160",null,"mm",160]
[null,null,null,"TL",5000,"175 mm",106000,160000,150,"NPL-5000x175",175,"TL 5000-175",null,"mm",175]
[null,null,null,"TL",5000,"200 mm",106000,160000,150,"NPL-5000x200",200,"TL 5000-200",null,"mm",200]
[null,null,null,"TL",5000,"225 mm",106000,160000,150,"NPL-5000x225",225,"TL 5000-225",null,"mm",225]
[null,null,null,"TL",5000,"250 mm",106000,160000,150,"NPL-5000x250",250,"TL 5000-250",null,"mm",250]
[null,null,null,"TL",7500,"25 mm",106000,160000,150,"NPL-7500x25",25,"TL 7500-25",null,"mm",25]
[null,null,null,"TL",7500,"37.5 mm",106000,160000,150,"NPL-7500x37.5",37.5,"TL 7500-37,5",null,"mm",37.5]
[null,null,null,"TL",7500,"50 mm",106000,160000,150,"NPL-7500x50",50,"TL 7500-50",null,"mm",50]
[null,null,null,"TL",7500,"62.5 mm",106000,160000,150,"NPL-7500x62.5",62.5,"TL 7500-62,5",null,"mm",62.5]
[null,null,null,"TL",7500,"75 mm",106000,160000,150,"NPL-7500x75",75,"TL 7500-75",null,"mm",75]
[null,null,null,"TL",7500,"80 mm",106000,160000,150,"NPL-7500x80",80,"TL 7500-80",null,"mm",80]
[null,null,null,"TL",7500,"87.5 mm",106000,160000,150,"NPL-7500x87.5",87.5,"TL 7500-87,5",null,"mm",87.5]
[null,null,null,"TL",7500,"100 mm",106000,160000,150,"NPL-7500x100",100,"TL 7500-100",null,"mm",100]
[null,null,null,"TL",7500,"112.5 mm",106000,160000,150,"NPL-7500x112.5",112.5,"TL 7500-112,5",null,"mm",112.5]
[null,null,null,"TL",7500,"125 mm",106000,160000,150,"NPL-7500x125",125,"TL 7500-125",null,"mm",125]
[null,null,null,"TL",7500,"137.5 mm",106000,160000,150,"NPL-7500x137.5",137.5,"TL 7500-137,5",null,"mm",137.5]
[null,null,null,"TL",7500,"150 mm",106000,160000,150,"NPL-7500x150",150,"TL 7500-150",null,"mm",150]
[null,null,null,"TL",7500,"160 mm",106000,160000,150,"NPL-7500x160",160,"TL 7500-160",null,"mm",160]
[null,null,null,"TL",7500,"175 mm",106000,160000,150,"NPL-7500x175",175,"TL 7500-175",null,"mm",175]
[null,null,null,"TL",7500,"200 mm",106000,160000,150,"NPL-7500x200",200,"TL 7500-200",null,"mm",200]
[null,null,null,"TL",7500,"225 mm",106000,160000,150,"NPL-7500x225",225,"TL 7500-225",null,"mm",225]
[null,null,null,"TL",7500,"250 mm",106000,160000,150,"NPL-7500x250",250,"TL 7500-250",null,"mm",250]
[null,null,null,"R",12,"7 mm",106000,160000,150,"T2-50x7",7,"R12-7",null,"mm",7]
[null,null,null,"R",12,"10 mm",106000,160000,150,"T2-50x10",10,"R12-10",null,"mm",10]
[null,null,null,"R",12,"12.7 mm",106000,160000,150,"T2-50x12.7",12.7,"R12-12,7",null,"mm",12.7]
[null,null,null,"R",12,"15 mm",106000,160000,150,"T2-50x15",15,"R12-15",null,"mm",15]
[null,null,null,"R",12,"19 mm",106000,160000,150,"T2-50x19",19,"R12-19",null,"mm",19]
[null,null,null,"R",12,"25 mm",106000,160000,150,"T2-50x25",25,"R12-25",null,"mm",25]
[null,null,null,"R",12,"38 mm",106000,160000,150,"T2-50x38",38,"R12-38,1",null,"mm",38]
[null,null,null,"R",12,"50 mm",106000,160000,150,"T2-50x50",50,"R12-50",null,"mm",50]
[null,null,null,"R",12,"63 mm",106000,160000,150,"T2-50x63",63,"R12-63,5",null,"mm",63]
[null,null,null,"R",12,"75 mm",2000,3060,180,"T2-50x75",75,"R12-75",null,"mm",75]
[null,null,null,"R",12,"80 mm",2000,3060,180,"T2-50x80",80,"R12-80",null,"mm",80]
[null,null,null,"R",12,"100 mm",106000,160000,150,"T2-50x100",100,"R12-100",null,"mm",100]
[null,null,null,"R",12,"125 mm",106000,160000,150,"T2-50x125",125,"R12-125",null,"mm",125]
[null,null,null,"R",15,"7 mm",2000,3060,180,"T2-70x7",{"$f":"IF(N450=\"mm\",O450,O450*25.4)","v":7},"R15-7",null,"mm",7]
[null,null,null,"R",15,"10 mm",2000,3060,180,"T2-70x10",10,"R15-10",null,"mm",10]
[null,null,null,"R",15,"12.7 mm",2000,3060,180,"T2-70x12.7",12.7,"R15-12,7",null,{"$f":"RIGHT(F452,2)","v":"mm"},{"$f":"VALUE(SUBSTITUTE(LEFT(F452,SEARCH(\" \",F452)-1),\".\",\",\"))","v":12.7}]
[null,null,null,"R",15,"15 mm",2000,3060,180,"T2-70x15",15,"R15-15",null,"mm",15]
[null,null,null,"R",15,"19 mm",2000,3060,180,"T2-70x19",19,"R15-19",null,"mm",19]
[null,null,null,"R",15,"25 mm",2000,3060,180,"T2-70x25",25,"R15-25",null,"mm",25]
[null,null,null,"R",15,"38 mm",2000,3060,180,"T2-70x38",38,"R15-38,1",null,"mm",38]
[null,null,null,"R",15,"50 mm",2000,3060,180,"T2-70x50",50,"R15-50",null,"mm",50]
[null,null,null,"R",15,"63 mm",2000,3060,180,"T2-70x63",63,"R15-63,5",null,"mm",63]
[null,null,null,"R",15,"75 mm",2000,3060,180,"T2-70x75",75,"R15-75",null,"mm",75]
[null,null,null,"R",15,"80 mm",2000,3060,180,"T2-70x80",80,"R15-80",null,"mm",80]
[null,null,null,"R",15,"100 mm",2000,3060,180,"T2-70x100",100,"R15-100",null,"mm",100]
[null,null,null,"R",15,"125 mm",2000,3060,180,"T2-70x125",125,"R15-125",null,"mm",125]
[null,null,null,"R",19,"7 mm",2000,3060,180,"T2-90x7",7,"R19-7",null,"mm",7]
[null,null,null,"R",19,"10 mm",2000,3060,180,"T2-90x10",10,"R19-10",null,"mm",10]
[null,null,null,"R",19,"15 mm",2000,3060,180,"T2-90x15",15,"R19-15",null,"mm",15]
[null,null,null,"R",19,"25 mm",2000,3060,180,"T2-90x25",25,"R19-25",null,"mm",25]
[null,null,null,"R",19,"38.1 mm",2000,3060,180,"T2-90x38.1",38.1,"R19-38,1",null,"mm",38.1]
[null,null,null,"R",19,"50 mm",2000,3060,180,"T2-90x50",50,"R19-50",null,"mm",50]
[null,null,null,"R",19,"63.5 mm",2000,3060,180,"T2-90x63.5",63.5,"R19-63,5",null,"mm",63.5]
[null,null,null,"R",19,"80 mm",2000,3060,180,"T2-90x80",80,"R19-80",null,"mm",80]
[null,null,null,"R",19,"100 mm",2000,3060,180,"T2-90x100",100,"R19-100",null,"mm",100]
[null,null,null,"R",19,"125 mm",2000,3060,180,"T2-90x125",125,"R19-125",null,"mm",125]
[null,null,null,"M",2,"10 mm",106000,160000,150,"T2-180x10",10,"M2-10",null,"mm",10]
[null,null,null,"M",2,"12.7 mm",106000,160000,150,"T2-180x12.7",12.7,"M2-12,7",null,"mm",12.7]
[null,null,null,"M",2,"15 mm",106000,160000,150,"T2-180x15",15,"M2-15",null,"mm",15]
[null,null,null,"M",2,"16 mm",106000,160000,150,"T2-180x16",16,"M2-16",null,"mm",16]
[null,null,null,"M",2,"25 mm",106000,160000,150,"T2-180x25",25,"M2-25",null,"mm",25]
[null,null,null,"M",2,"38.1 mm",106000,160000,150,"T2-180x38.1",38.1,"M2-38,1",null,"mm",38.1]
[null,null,null,"M",2,"50 mm",106000,160000,150,"T2-180x50",50,"M2-50",null,"mm",50]
[null,null,null,"M",2,"63.5 mm",106000,160000,150,"T2-180x63.5",63.5,"M2-63,5",null,"mm",63.5]
[null,null,null,"M",2,"80 mm",106000,160000,150,"T2-180x80",80,"M2-80",null,"mm",80]
[null,null,null,"M",2,"100 mm",106000,160000,150,"T2-180x100",100,"M2-100",null,"mm",100]
[null,null,null,"M",2,"125 mm",106000,160000,150,"T2-180x125",125,"M2-125",null,"mm",125]
[null,null,null,"M","C3","10 mm",106000,160000,150,"T2-200x10",10,"MC3-10",null,"mm",10]
[null,null,null,"M","C3","12.7 mm",106000,160000,150,"T2-200x12.7",12.7,"MC3-12,7",null,"mm",12.7]
[null,null,null,"M","C3","16 mm",106000,160000,150,"T2-200x16",16,"MC3-16",null,"mm",16]
[null,null,null,"M","C3","25 mm",106000,160000,150,"T2-200x25",25,"MC3-25",null,"mm",25]
[null,null,null,"M","C3","38.1 mm",106000,160000,150,"T2-200x38.1",38.1,"MC3-38,1",null,"mm",38.1]
[null,null,null,"M","C3","50 mm",106000,160000,150,"T2-200x50",50,"MC3-50",null,"mm",50]
[null,null,null,"M","C3","63.5 mm",106000,160000,150,"T2-200x63.5",63.5,"MC3-63,5",null,"mm",63.5]
[null,null,null,"M","C3","80 mm",106000,160000,150,"T2-200x80",80,"MC3-80",null,"mm",80]
[null,null,null,"M","C3","100 mm",106000,160000,150,"T2-200x100",100,"MC3-100",null,"mm",100]
[null,null,null,"M","C3","125 mm",106000,160000,150,"T2-200x125",125,"MC3-125",null,"mm",125]
[null,null,null,"XG",350,"10 mm",24000,39300,150,"T3T-350x10",10,"XG 350-10",null,"mm",10]
[null,null,null,"XG",350,"13 mm",24000,39300,150,"T3T-350x13",13,"XG 350-13",null,"mm",13]
[null,null,null,"XG",350,"16 mm",24000,39300,150,"T3T-350x16",16,"XG 350-16",null,"mm",16]
[null,null,null,"XG",350,"19 mm",24000,39300,150,"T3T-350x19",19,"XG 350-19",null,"mm",19]
[null,null,null,"XG",350,"25 mm",24000,39300,150,"T3T-350x25",25,"XG 350-25",null,"mm",25]
[null,null,null,"XG",350,"32 mm",24000,39300,150,"T3T-350x32",32,"XG 350-32",null,"mm",32]
[null,null,null,"XG",350,"38 mm",24000,39300,150,"T3T-350x38",38,"XG 350-38",null,"mm",38]
[null,null,null,"XG",350,"50 mm",24000,39300,150,"T3T-350x50",50,"XG 350-50",null,"mm",50]
[null,null,null,"XG",350,"63 mm",24000,39300,150,"T3T-350x63",63,"XG 350-63",null,"mm",63]
[null,null,null,"XG",350,"75 mm",24000,39300,150,"T3T-350x75",75,"XG 350-75",null,"mm",75]
[null,null,null,"XG",350,"80 mm",24000,39300,150,"T3T-350x80",80,"XG 350-80",null,"mm",80]
[null,null,null,"XG",350,"100 mm",24000,39300,150,"T3T-350x100",100,"XG 350-100",null,"mm",100]
[null,null,null,"XG",350,"125 mm",24000,39300,150,"T3T-350x125",125,"XG 350-125",null,"mm",125]
[null,null,null,"XG",500,"10 mm",24000,39300,150,"T3T-500x10",10,"XG 500-10",null,"mm",10]
[null,null,null,"XG",500,"13 mm",24000,39300,150,"T3T-500x13",13,"XG 500-13",null,"mm",13]
[null,null,null,"XG",500,"16 mm",24000,39300,150,"T3T-500x16",16,"XG 500-16",null,"mm",16]
[null,null,null,"XG",500,"19 mm",24000,39300,150,"T3T-500x19",19,"XG 500-19",null,"mm",19]
[null,null,null,"XG",500,"25 mm",24000,39300,150,"T3T-500x25",25,"XG 500-25",null,"mm",25]
[null,null,null,"XG",500,"32 mm",24000,39300,150,"T3T-500x32",32,"XG 500-32",null,"mm",32]
[null,null,null,"XG",500,"38 mm",24000,39300,150,"T3T-500x38",38,"XG 500-38",null,"mm",38]
[null,null,null,"XG",500,"50 mm",24000,39300,150,"T3T-500x50",{"$f":"IF(N514=\"mm\",O514,O514*25.4)","v":50},"XG 500-50",null,"mm",50]
[null,null,null,"XG",500,"63 mm",24000,39300,150,"T3T-500x63",63,"XG 500-63",null,"mm",63]
[null,null,null,"XG",500,"75 mm",24000,39300,150,"T3T-500x75",75,"XG 500-75",null,{"$f":"RIGHT(F516,2)","v":"mm"},{"$f":"VALUE(SUBSTITUTE(LEFT(F516,SEARCH(\" \",F516)-1),\".\",\",\"))","v":75}]
[null,null,null,"XG",500,"80 mm",24000,39300,150,"T3T-500x80",80,"XG 500-80",null,"mm",80]
[null,null,null,"XG",500,"100 mm",24000,39300,150,"T3T-500x100",100,"XG 500-100",null,"mm",100]
[null,null,null,"XG",500,"125 mm",24000,39300,150,"T3T-500x125",125,"XG 500-125",null,"mm",125]
[null,null,null,"XG",750,"10 mm",24000,39300,150,"T3T-750x10",10,"XG 750-10",null,"mm",10]
[null,null,null,"XG",750,"13 mm",24000,39300,150,"T3T-750x13",13,"XG 750-13",null,"mm",13]
[null,null,null,"XG",750,"16 mm",24000,39300,150,"T3T-750x16",16,"XG 750-16",null,"mm",16]
[null,null,null,"XG",750,"19 mm",24000,39300,150,"T3T-750x19",19,"XG 750-19",null,"mm",19]
[null,null,null,"XG",750,"25 mm",24000,39300,150,"T3T-750x25",25,"XG 750-25",null,"mm",25]
[null,null,null,"XG",750,"32 mm",24000,39300,150,"T3T-750x32",32,"XG 750-32",null,"mm",32]
[null,null,null,"XG",750,"38 mm",24000,39300,150,"T3T-750x38",38,"XG 750-38",null,"mm",38]
[null,null,null,"XG",750,"50 mm",24000,39300,150,"T3T-750x50",50,"XG 750-50",null,"mm",50]
[null,null,null,"XG",750,"63 mm",24000,39300,150,"T3T-750x63",63,"XG 750-63",null,"mm",63]
[null,null,null,"XG",750,"75 mm",24000,39300,150,"T3T-750x75",75,"XG 750-75",null,"mm",75]
[null,null,null,"XG",750,"80 mm",24000,39300,150,"T3T-750x80",80,"XG 750-80",null,"mm",80]
[null,null,null,"XG",750,"100 mm",24000,39300,150,"T3T-750x100",100,"XG 750-100",null,"mm",100]
[null,null,null,"XG",750,"125 mm",24000,39300,150,"T3T-750x125",125,"XG 750-125",null,"mm",125]
[null,null,null,"XG",1000,"13 mm",2000,3060,180,"T3T-1000x13",13,"XG 1000-13",null,"mm",13]
[null,null,null,"XG",1000,"16 mm",2000,3060,180,"T3T-1000x16",16,"XG 1000-16",null,"mm",16]
[null,null,null,"XG",1000,"19 mm",2000,3060,180,"T3T-1000x19",19,"XG 1000-19",null,"mm",19]
[null,null,null,"XG",1000,"25 mm",2000,3060,180,"T3T-1000x25",25,"XG 1000-25",null,"mm",25]
[null,null,null,"XG",1000,"32 mm",2000,3060,180,"T3T-1000x32",32,"XG 1000-32",null,"mm",32]
[null,null,null,"XG",1000,"38 mm",2000,3060,180,"T3T-1000x38",38,"XG 1000-38",null,"mm",38]
[null,null,null,"XG",1000,"50 mm",2000,3060,180,"T3T-1000x50",50,"XG 1000-50",null,"mm",50]
[null,null,null,"XG",1000,"63 mm",2000,3060,180,"T3T-1000x63",63,"XG 1000-63",null,"mm",63]
[null,null,null,"XG",1000,"75 mm",2000,3060,180,"T3T-1000x75",75,"XG 1000-75",null,"mm",75]
[null,null,null,"XG",1000,"80 mm",2000,3060,180,"T3T-1000x80",80,"XG 1000-80",null,"mm",80]
[null,null,null,"XG",1000,"100 mm",2000,3060,180,"T3T-1000x100",100,"XG 1000-100",null,"mm",100]
[null,null,null,"XG",1000,"125 mm",2000,3060,180,"T3T-1000x125",125,"XG 1000-125",null,"mm",125]
[null,null,null,"XG",1500,"13 mm",2000,3060,180,"T3T-1500x13",13,"XG 1500-13",null,"mm",13]
[null,null,null,"XG",1500,"16 mm",2000,3060,180,"T3T-1500x16",16,"XG 1500-16",null,"mm",16]
[null,null,null,"XG",1500,"19 mm",2000,3060,180,"T3T-1500x19",19,"XG 1500-19",null,"mm",19]
[null,null,null,"XG",1500,"25 mm",2000,3060,180,"T3T-1500x25",25,"XG 1500-25",null,"mm",25]
[null,null,null,"XG",1500,"32 mm",2000,3060,180,"T3T-1500x32",32,"XG 1500-32",null,"mm",32]
[null,null,null,"XG",1500,"38 mm",2000,3060,180,"T3T-1500x38",38,"XG 1500-38",null,"mm",38]
[null,null,null,"XG",1500,"50 mm",2000,3060,180,"T3T-1500x50",50,"XG 1500-50",null,"mm",50]
[null,null,null,"XG",1500,"63 mm",2000,3060,180,"T3T-1500x63",63,"XG 1500-63",null,"mm",63]
[null,null,null,"XG",1500,"75 mm",2000,3060,180,"T3T-1500x75",75,"XG 1500-75",null,"mm",75]
[null,null,null,"XG",1500,"80 mm",2000,3060,180,"T3T-1500x80",80,"XG 1500-80",null,"mm",80]
[null,null,null,"XG",1500,"100 mm",2000,3060,180,"T3T-1500x100",100,"XG 1500-100",null,"mm",100]
[null,null,null,"XG",1500,"125 mm",2000,3060,180,"T3T-1500x125",125,"XG 1500-125",null,"mm",125]
[null,null,null,"XG",2400,"16 mm",2000,3060,180,"T3T-2400x16",16,"XG 2400-16",null,"mm",16]
[null,null,null,"XG",2400,"19 mm",2000,3060,180,"T3T-2400x19",19,"XG 2400-19",null,"mm",19]
[null,null,null,"XG",2400,"25 mm",2000,3060,180,"T3T-2400x25",25,"XG 2400-25",null,"mm",25]
[null,null,null,"XG",2400,"32 mm",2000,3060,180,"T3T-2400x32",32,"XG 2400-32",null,"mm",32]
[null,null,null,"XG",2400,"38 mm",2000,3060,180,"T3T-2400x38",38,"XG 2400-38",null,"mm",38]
[null,null,null,"XG",2400,"50 mm",2000,3060,180,"T3T-2400x50",50,"XG 2400-50",null,"mm",50]
[null,null,null,"XG",2400,"63 mm",24000,39300,150,"T3T-2400x63",63,"XG 2400-63",null,"mm",63]
[null,null,null,"XG",2400,"75 mm",24000,39300,150,"T3T-2400x75",75,"XG 2400-75",null,"mm",75]
[null,null,null,"XG",2400,"80 mm",24000,39300,150,"T3T-2400x80",80,"XG 2400-80",null,"mm",80]
[null,null,null,"XG",2400,"100 mm",2000,3060,180,"T3T-2400x100",100,"XG 2400-100",null,"mm",100]
[null,null,null,"XG",2400,"125 mm",2000,3060,180,"T3T-2400x125",125,"XG 2400-125",null,"mm",125]
[null,null,null,"XG",4200,"16 mm",24000,39300,150,"T3T-4200x16",16,"XG 4200-16",null,"mm",16]
[null,null,null,"XG",4200,"19 mm",24000,39300,150,"T3T-4200x19",19,"XG 4200-19",null,"mm",19]
[null,null,null,"XG",4200,"25 mm",24000,39300,150,"T3T-4200x25",25,"XG 4200-25",null,"mm",25]
[null,null,null,"XG",4200,"32 mm",24000,39300,150,"T3T-4200x32",32,"XG 4200-32",null,"mm",32]
[null,null,null,"XG",4200,"38 mm",24000,39300,150,"T3T-4200x38",38,"XG 4200-38",null,"mm",38]
[null,null,null,"XG",4200,"50 mm",24000,39300,150,"T3T-4200x50",50,"XG 4200-50",null,"mm",50]
[null,null,null,"XG",4200,"63 mm",24000,39300,150,"T3T-4200x63",63,"XG 4200-63",null,"mm",63]
[null,null,null,"XG",4200,"75 mm",24000,39300,150,"T3T-4200x75",75,"XG 4200-75",null,"mm",75]
[null,null,null,"XG",4200,"80 mm",24000,39300,150,"T3T-4200x80",80,"XG 4200-80",null,"mm",80]
[null,null,null,"XG",4200,"100 mm",24000,39300,150,"T3T-4200x100",100,"XG 4200-100",null,"mm",100]
[null,null,null,"XG",4200,"125 mm",24000,39300,150,"T3T-4200x125",{"$f":"IF(N578=\"mm\",O578,O578*25.4)","v":125},"XG 4200-125",null,"mm",125]
[null,null,null,"XG",6600,"16 mm",24000,39300,150,"T3T-6600x16",16,"XG 6600-16",null,"mm",16]
[null,null,null,"XG",6600,"19 mm",24000,39300,150,"T3T-6600x19",19,"XG 6600-19",null,{"$f":"RIGHT(F580,2)","v":"mm"},{"$f":"VALUE(SUBSTITUTE(LEFT(F580,SEARCH(\" \",F580)-1),\".\",\",\"))","v":19}]
[null,null,null,"XG",6600,"25 mm",24000,39300,150,"T3T-6600x25",25,"XG 6600-25",null,"mm",25]
[null,null,null,"XG",6600,"32 mm",24000,39300,150,"T3T-6600x32",32,"XG 6600-32",null,"mm",32]
[null,null,null,"XG",6600,"38 mm",24000,39300,150,"T3T-6600x38",38,"XG 6600-38",null,"mm",38]
[null,null,null,"XG",6600,"50 mm",24000,39300,150,"T3T-6600x50",50,"XG 6600-50",null,"mm",50]
[null,null,null,"XG",6600,"63 mm",24000,39300,150,"T3T-6600x63",63,"XG 6600-63",null,"mm",63]
[null,null,null,"XG",6600,"75 mm",24000,39300,150,"T3T-6600x75",75,"XG 6600-75",null,"mm",75]
[null,null,null,"XG",6600,"80 mm",24000,39300,150,"T3T-6600x80",80,"XG 6600-80",null,"mm",80]
[null,null,null,"XG",6600,"100 mm",24000,39300,150,"T3T-6600x100",100,"XG 6600-100",null,"mm",100]
[null,null,null,"XG",6600,"125 mm",24000,39300,150,"T3T-6600x125",125,"XG 6600-125",null,"mm",125]
[null,null,null,"XG",9500,"19 mm",24000,39300,150,"T3T-9500x19",19,"XG 9500-19",null,"mm",19]
[null,null,null,"XG",9500,"25 mm",24000,39300,150,"T3T-9500x25",25,"XG 9500-25",null,"mm",25]
[null,null,null,"XG",9500,"32 mm",24000,39300,150,"T3T-9500x32",32,"XG 9500-32",null,"mm",32]
[null,null,null,"XG",9500,"38 mm",24000,39300,150,"T3T-9500x38",38,"XG 9500-38",null,"mm",38]
[null,null,null,"XG",9500,"50 mm",24000,39300,150,"T3T-9500x50",50,"XG 9500-50",null,"mm",50]
[null,null,null,"XG",9500,"63 mm",24000,39300,150,"T3T-9500x63",63,"XG 9500-63",null,"mm",63]
[null,null,null,"XG",9500,"75 mm",24000,39300,150,"T3T-9500x75",75,"XG 9500-75",null,"mm",75]
[null,null,null,"XG",9500,"80 mm",24000,39300,150,"T3T-9500x80",80,"XG 9500-80",null,"mm",80]
[null,null,null,"XG",9500,"100 mm",24000,39300,150,"T3T-9500x100",100,"XG 9500-100",null,"mm",100]
[null,null,null,"XG",9500,"125 mm",24000,39300,150,"T3T-9500x125",125,"XG 9500-125",null,"mm",125]
[null,null,null,"XF",750,"10 mm",2000,3060,180,"T3F-750x10",10,"XF 750-10",null,"mm",10]
[null,null,null,"XF",750,"13 mm",2000,3060,180,"T3F-750x13",13,"XF 750-13",null,"mm",13]
[null,null,null,"XF",750,"16 mm",2000,3060,180,"T3F-750x16",16,"XF 750-16",null,"mm",16]
[null,null,null,"XF",750,"19 mm",2000,3060,180,"T3F-750x19",19,"XF 750-19",null,"mm",19]
[null,null,null,"XF",750,"25 mm",2000,3060,180,"T3F-750x25",25,"XF 750-25",null,"mm",25]
[null,null,null,"XF",750,"32 mm",2000,3060,180,"T3F-750x32",32,"XF 750-32",null,"mm",32]
[null,null,null,"XF",750,"38 mm",2000,3060,180,"T3F-750x38",38,"XF 750-38",null,"mm",38]
[null,null,null,"XF",750,"50 mm",2000,3060,180,"T3F-750x50",50,"XF 750-50",null,"mm",50]
[null,null,null,"XF",750,"63 mm",2000,3060,180,"T3F-750x63",63,"XF 750-63",null,"mm",63]
[null,null,null,"XF",750,"75 mm",2000,3060,180,"T3F-750x75",75,"XF 750-75",null,"mm",75]
[null,null,null,"XF",750,"80 mm",2000,3060,180,"T3F-750x80",80,"XF 750-80",null,"mm",80]
[null,null,null,"XF",750,"100 mm",2000,3060,180,"T3F-750x100",100,"XF 750-100",null,"mm",100]
[null,null,null,"XF",750,"125 mm",2000,3060,180,"T3F-750x125",125,"XF 750-125",null,"mm",125]
[null,null,null,"XF",1000,"13 mm",2000,3060,180,"T3F-1000x13",13,"XF 1000-13",null,"mm",13]
[null,null,null,"XF",1000,"16 mm",2000,3060,180,"T3F-1000x16",16,"XF 1000-16",null,"mm",16]
[null,null,null,"XF",1000,"19 mm",2000,3060,180,"T3F-1000x19",19,"XF 1000-19",null,"mm",19]
[null,null,null,"XF",1000,"25 mm",2000,3060,180,"T3F-1000x25",25,"XF 1000-25",null,"mm",25]
[null,null,null,"XF",1000,"32 mm",2000,3060,180,"T3F-1000x32",32,"XF 1000-32",null,"mm",32]
[null,null,null,"XF",1000,"38 mm",2000,3060,180,"T3F-1000x38",38,"XF 1000-38",null,"mm",38]
[null,null,null,"XF",1000,"50 mm",2000,3060,180,"T3F-1000x50",50,"XF 1000-50",null,"mm",50]
[null,null,null,"XF",1000,"63 mm",2000,3060,180,"T3F-1000x63",63,"XF 1000-63",null,"mm",63]
[null,null,null,"XF",1000,"75 mm",2000,3060,180,"T3F-1000x75",75,"XF 1000-75",null,"mm",75]
[null,null,null,"XF",1000,"80 mm",2000,3060,180,"T3F-1000x80",80,"XF 1000-80",null,"mm",80]
[null,null,null,"XF",1000,"100 mm",2000,3060,180,"T3F-1000x100",100,"XF 1000-100",null,"mm",100]
[null,null,null,"XF",1000,"125 mm",2000,3060,180,"T3F-1000x125",125,"XF 1000-125",null,"mm",125]
[null,null,null,"XF",1500,"13 mm",2000,3060,180,"T3F-1500x13",13,"XF 1500-13",null,"mm",13]
[null,null,null,"XF",1500,"16 mm",2000,3060,180,"T3F-1500x16",16,"XF 1500-16",null,"mm",16]
[null,null,null,"XF",1500,"19 mm",2000,3060,180,"T3F-1500x19",19,"XF 1500-19",null,"mm",19]
[null,null,null,"XF",1500,"25 mm",2000,3060,180,"T3F-1500x25",25,"XF 1500-25",null,"mm",25]
[null,null,null,"XF",1500,"32 mm",2000,3060,180,"T3F-1500x32",32,"XF 1500-32",null,"mm",32]
[null,null,null,"XF",1500,"38 mm",2000,3060,180,"T3F-1500x38",38,"XF 1500-38",null,"mm",38]
[null,null,null,"XF",1500,"50 mm",2000,3060,180,"T3F-1500x50",50,"XF 1500-50",null,"mm",50]
[null,null,null,"XF",1500,"63 mm",2000,3060,180,"T3F-1500x63",63,"XF 1500-63",null,"mm",63]
[null,null,null,"XF",1500,"75 mm",2000,3060,180,"T3F-1500x75",75,"XF 1500-75",null,"mm",75]
[null,null,null,"XF",1500,"80 mm",2000,3060,180,"T3F-1500x80",80,"XF 1500-80",null,"mm",80]
[null,null,null,"XF",1500,"100 mm",2000,3060,180,"T3F-1500x100",100,"XF 1500-100",null,"mm",100]
[null,null,null,"XF",1500,"125 mm",2000,3060,180,"T3F-1500x125",125,"XF 1500-125",null,"mm",125]
[null,null,null,"XF",2400,"16 mm",2000,3060,180,"T3F-2400x16",16,"XF 2400-16",null,"mm",16]
[null,null,null,"XF",2400,"19 mm",2000,3060,180,"T3F-2400x19",19,"XF 2400-19",null,"mm",19]
[null,null,null,"XF",2400,"25 mm",2000,3060,180,"T3F-2400x25",25,"XF 2400-25",null,"mm",25]
[null,null,null,"XF",2400,"32 mm",2000,3060,180,"T3F-2400x32",32,"XF 2400-32",null,"mm",32]
[null,null,null,"XF",2400,"38 mm",2000,3060,180,"T3F-2400x38",38,"XF 2400-38",null,"mm",38]
[null,null,null,"XF",2400,"50 mm",2000,3060,180,"T3F-2400x50",{"$f":"IF(N642=\"mm\",O642,O642*25.4)","v":50},"XF 2400-50",null,"mm",50]
[null,null,null,"XF",2400,"63 mm",2000,3060,180,"T3F-2400x63",63,"XF 2400-63",null,"mm",63]
[null,null,null,"XF",2400,"75 mm",2000,3060,180,"T3F-2400x75",75,"XF 2400-75",null,{"$f":"RIGHT(F644,2)","v":"mm"},{"$f":"VALUE(SUBSTITUTE(LEFT(F644,SEARCH(\" \",F644)-1),\".\",\",\"))","v":75}]
[null,null,null,"XF",2400,"80 mm",2000,3060,180,"T3F-2400x80",80,"XF 2400-80",null,"mm",80]
[null,null,null,"XF",2400,"100 mm",2000,3060,180,"T3F-2400x100",100,"XF 2400-100",null,"mm",100]
[null,null,null,"XF",2400,"125 mm",2000,3060,180,"T3F-2400x125",125,"XF 2400-125",null,"mm",125]
[null,null,null,"CU4",420,"6 mm",183000,253000,150,"T4SC-420x6",6,"CU4 420-6",null,"mm",6]
[null,null,null,"CU4",420,"10 mm",183000,253000,150,"T4SC-420x10",10,"CU4 420-10",null,"mm",10]
[null,null,null,"CU4",420,"16 mm",183000,253000,150,"T4SC-420x16",16,"CU4 420-16",null,"mm",16]
[null,null,null,"CU4",420,"25 mm",183000,253000,150,"T4SC-420x25",25,"CU4 420-25",null,"mm",25]
[null,null,null,"CU4",420,"32 mm",183000,253000,150,"T4SC-420x32",32,"CU4 420-32",null,"mm",32]
[null,null,null,"CU4",420,"40 mm",183000,253000,150,"T4SC-420x40",40,"CU4 420-40",null,"mm",40]
[null,null,null,"CU4",420,"50 mm",183000,253000,150,"T4SC-420x50",50,"CU4 420-50",null,"mm",50]
[null,null,null,"CU4",740,"6 mm",183000,253000,150,"T4SC-740x6",6,"CU4 740-6",null,"mm",6]
[null,null,null,"CU4",740,"10 mm",183000,253000,150,"T4SC-740x10",10,"CU4 740-10",null,"mm",10]
[null,null,null,"CU4",740,"16 mm",183000,253000,150,"T4SC-740x16",16,"CU4 740-16",null,"mm",16]
[null,null,null,"CU4",740,"25 mm",183000,253000,150,"T4SC-740x25",25,"CU4 740-25",null,"mm",25]
[null,null,null,"CU4",740,"32 mm",183000,253000,150,"T4SC-740x32",32,"CU4 740-32",null,"mm",32]
[null,null,null,"CU4",740,"40 mm",183000,253000,150,"T4SC-740x40",40,"CU4 740-40",null,"mm",40]
[null,null,null,"CU4",740,"50 mm",183000,253000,150,"T4SC-740x50",50,"CU4 740-50",null,"mm",50]
[null,null,null,"CU4",1000,"6 mm",24000,39300,150,"T4SC-1000x6",6,"CU4 1000-6",null,"mm",6]
[null,null,null,"CU4",1000,"10 mm",24000,39300,150,"T4SC-1000x10",10,"CU4 1000-10",null,"mm",10]
[null,null,null,"CU4",1000,"16 mm",24000,39300,150,"T4SC-1000x16",16,"CU4 1000-16",null,"mm",16]
[null,null,null,"CU4",1000,"25 mm",24000,39300,150,"T4SC-1000x25",25,"CU4 1000-25",null,"mm",25]
[null,null,null,"CU4",1000,"32 mm",24000,39300,150,"T4SC-1000x32",32,"CU4 1000-32",null,"mm",32]
[null,null,null,"CU4",1000,"40 mm",24000,39300,150,"T4SC-1000x40",40,"CU4 1000-40",null,"mm",40]
[null,null,null,"CU4",1000,"50 mm",24000,39300,150,"T4SC-1000x50",50,"CU4 1000-50",null,"mm",50]
[null,null,null,"CU4",1800,"6 mm",24000,39300,150,"T4SC-1800x6",6,"CU4 1800-6",null,"mm",6]
[null,null,null,"CU4",1800,"10 mm",24000,39300,150,"T4SC-1800x10",10,"CU4 1800-10",null,"mm",10]
[null,null,null,"CU4",1800,"16 mm",24000,39300,150,"T4SC-1800x16",16,"CU4 1800-16",null,"mm",16]
[null,null,null,"CU4",1800,"25 mm",24000,39300,150,"T4SC-1800x25",25,"CU4 1800-25",null,"mm",25]
[null,null,null,"CU4",1800,"32 mm",24000,39300,150,"T4SC-1800x32",32,"CU4 1800-32",null,"mm",32]
[null,null,null,"CU4",1800,"40 mm",24000,39300,150,"T4SC-1800x40",40,"CU4 1800-40",null,"mm",40]
[null,null,null,"CU4",1800,"50 mm",24000,39300,150,"T4SC-1800x50",50,"CU4 1800-50",null,"mm",50]
[null,null,null,"CU4",1800,"65 mm",24000,39300,150,"T4SC-1800x65",65,"CU4 1800-65",null,"mm",65]
[null,null,null,"CU4",2900,"10 mm",24000,39300,150,"T4SC-2900x10",10,"CU4 2900-10",null,"mm",10]
[null,null,null,"CU4",2900,"16 mm",24000,39300,150,"T4SC-2900x16",16,"CU4 2900-16",null,"mm",16]
[null,null,null,"CU4",2900,"25 mm",24000,39300,150,"T4SC-2900x25",25,"CU4 2900-25",null,"mm",25]
[null,null,null,"CU4",2900,"32 mm",24000,39300,150,"T4SC-2900x32",32,"CU4 2900-32",null,"mm",32]
[null,null,null,"CU4",2900,"40 mm",183000,253000,150,"T4SC-2900x40",40,"CU4 2900-40",null,"mm",40]
[null,null,null,"CU4",2900,"50 mm",183000,253000,150,"T4SC-2900x50",50,"CU4 2900-50",null,"mm",50]
[null,null,null,"CU4",2900,"65 mm",183000,253000,150,"T4SC-2900x65",65,"CU4 2900-65",null,"mm",65]
[null,null,null,"CU4",4700,"10 mm",183000,253000,150,"T4SC-4700x10",10,"CU4 4700-10",null,"mm",10]
[null,null,null,"CU4",4700,"16 mm",183000,253000,150,"T4SC-4700x16",16,"CU4 4700-16",null,"mm",16]
[null,null,null,"CU4",4700,"25 mm",183000,253000,150,"T4SC-4700x25",25,"CU4 4700-25",null,"mm",25]
[null,null,null,"CU4",4700,"32 mm",183000,253000,150,"T4SC-4700x32",32,"CU4 4700-32",null,"mm",32]
[null,null,null,"CU4",4700,"40 mm",183000,253000,150,"T4SC-4700x40",40,"CU4 4700-40",null,"mm",40]
[null,null,null,"CU4",4700,"50 mm",183000,253000,150,"T4SC-4700x50",50,"CU4 4700-50",null,"mm",50]
[null,null,null,"CU4",4700,"65 mm",183000,253000,150,"T4SC-4700x65",65,"CU4 4700-65",null,"mm",65]
[null,null,null,"CU4",7500,"10 mm",183000,253000,150,"T4SC-7500x10",10,"CU4 7500-10",null,"mm",10]
[null,null,null,"CU4",7500,"16 mm",183000,253000,150,"T4SC-7500x16",16,"CU4 7500-16",null,"mm",16]
[null,null,null,"CU4",7500,"25 mm",183000,253000,150,"T4SC-7500x25",25,"CU4 7500-25",null,"mm",25]
[null,null,null,"CU4",7500,"32 mm",183000,253000,150,"T4SC-7500x32",32,"CU4 7500-32",null,"mm",32]
[null,null,null,"CU4",7500,"40 mm",183000,253000,150,"T4SC-7500x40",40,"CU4 7500-40",null,"mm",40]
[null,null,null,"CU4",7500,"50 mm",183000,253000,150,"T4SC-7500x50",50,"CU4 7500-50",null,"mm",50]
[null,null,null,"CU4",7500,"65 mm",183000,253000,150,"T4SC-7500x65",65,"CU4 7500-65",null,"mm",65]
[null,null,null,"CU4",11800,"10 mm",24000,39300,150,"T4SC-11800x10",10,"CU4 11800-10",null,"mm",10]
[null,null,null,"CU4",11800,"16 mm",24000,39300,150,"T4SC-11800x16",16,"CU4 11800-16",null,"mm",16]
[null,null,null,"CU4",11800,"25 mm",24000,39300,150,"T4SC-11800x25",25,"CU4 11800-25",null,"mm",25]
[null,null,null,"CU4",11800,"32 mm",24000,39300,150,"T4SC-11800x32",32,"CU4 11800-32",null,"mm",32]
[null,null,null,"CU4",11800,"40 mm",24000,39300,150,"T4SC-11800x40",40,"CU4 11800-40",null,"mm",40]
[null,null,null,"CU4",11800,"50 mm",24000,39300,150,"T4SC-11800x50",50,"CU4 11800-50",null,"mm",50]
[null,null,null,"CU4",11800,"65 mm",24000,39300,150,"T4SC-11800x65",65,"CU4 11800-65",null,"mm",65]
[null,null,null,"CU4",18300,"10 mm",24000,39300,150,"T4SC-18300x10",10,"CU4 18300-10",null,"mm",10]
[null,null,null,"CU4",18300,"16 mm",24000,39300,150,"T4SC-18300x16",{"$f":"IF(N706=\"mm\",O706,O706*25.4)","v":16},"CU4 18300-16",null,"mm",16]
[null,null,null,"CU4",18300,"25 mm",24000,39300,150,"T4SC-18300x25",25,"CU4 18300-25",null,"mm",25]
[null,null,null,"CU4",18300,"32 mm",24000,39300,150,"T4SC-18300x32",32,"CU4 18300-32",null,{"$f":"RIGHT(F708,2)","v":"mm"},{"$f":"VALUE(SUBSTITUTE(LEFT(F708,SEARCH(\" \",F708)-1),\".\",\",\"))","v":32}]
[null,null,null,"CU4",18300,"40 mm",24000,39300,150,"T4SC-18300x40",40,"CU4 18300-40",null,"mm",40]
[null,null,null,"CU4",18300,"50 mm",24000,39300,150,"T4SC-18300x50",50,"CU4 18300-50",null,"mm",50]
[null,null,null,"CU4",18300,"65 mm",24000,39300,150,"T4SC-18300x65",65,"CU4 18300-65",null,"mm",65]
[null,null,null,"CX",500,"10 mm",19200,35600,200,"T5-500x10",10,"CX 500-10",null,"mm",10]
[null,null,null,"CX",500,"15 mm",19200,35600,200,"T5-500x15",15,"CX 500-15",null,"mm",15]
[null,null,null,"CX",500,"25 mm",19200,35600,200,"T5-500x25",25,"CX 500-25",null,"mm",25]
[null,null,null,"CX",500,"38 mm",19200,35600,200,"T5-500x38",38,"CX 500-38",null,"mm",38]
[null,null,null,"CX",500,"50 mm",19200,35600,200,"T5-500x50",50,"CX 500-50",null,"mm",50]
[null,null,null,"CX",500,"63 mm",19200,35600,200,"T5-500x63",63,"CX 500-63",null,"mm",63]
[null,null,null,"CX",500,"80 mm",19200,35600,200,"T5-500x80",80,"CX 500-80",null,"mm",80]
[null,null,null,"CX",1000,"10 mm",183000,253000,150,"T5-1000x10",10,"CX 1000-10",null,"mm",10]
[null,null,null,"CX",1000,"15 mm",183000,253000,150,"T5-1000x15",15,"CX 1000-15",null,"mm",15]
[null,null,null,"CX",1000,"25 mm",183000,253000,150,"T5-1000x25",25,"CX 1000-25",null,"mm",25]
[null,null,null,"CX",1000,"38 mm",183000,253000,150,"T5-1000x38",38,"CX 1000-38",null,"mm",38]
[null,null,null,"CX",1000,"50 mm",183000,253000,150,"T5-1000x50",50,"CX 1000-50",null,"mm",50]
[null,null,null,"CX",1000,"63 mm",183000,253000,150,"T5-1000x63",63,"CX 1000-63",null,"mm",63]
[null,null,null,"CX",1000,"80 mm",9800,17300,200,"T5-1000x80",80,"CX 1000-80",null,"mm",80]
[null,null,null,"CX",1900,"10 mm",19200,26300,200,"T5-1900x10",10,"CX 1900-10",null,"mm",10]
[null,null,null,"CX",1900,"15 mm",19200,31800,200,"T5-1900x15",15,"CX 1900-15",null,"mm",15]
[null,null,null,"CX",1900,"25 mm",19200,30900,200,"T5-1900x25",25,"CX 1900-25",null,"mm",25]
[null,null,null,"CX",1900,"38 mm",19200,31900,200,"T5-1900x38",38,"CX 1900-38",null,"mm",38]
[null,null,null,"CX",1900,"50 mm",19200,33800,200,"T5-1900x50",50,"CX 1900-50",null,"mm",50]
[null,null,null,"CX",1900,"63 mm",19200,34800,200,"T5-1900x63",63,"CX 1900-63",null,"mm",63]
[null,null,null,"CX",1900,"80 mm",19200,35600,200,"T5-1900x80",80,"CX 1900-80",null,"mm",80]

{"sheet":"Unit conv","index":6,"n_rows":84,"n_cols":5,"rows_kept":84,"cut":false,"hidden":true,"merged":[]}
[]
[]
[]
[]
[null,"Units","Metric  (bar, kN, mm, °C)"]
[null,null,"Imperial  (psi, lbf, inch, °F)"]
[]
[null,null,1,1]
[]
[]
[]
["Unit convertion"]
[]
[]
[null,null,"Pressure"]
[null,{"$f":"C8","v":1},"bar",1]
["Konverteringsfaktor",{"$f":"INDEX(D16:D17,B16)","v":1},"psi",14.503773799999999]
[null,{"$f":"INDEX(C16:C17,B16)","v":"bar"}]
[]
[]
[null,null,"Force"]
[null,{"$f":"C8","v":1},"kN",1]
["Konverteringsfaktor",{"$f":"INDEX(D22:D23,B22)","v":1},"lbf",224.80889999999999]
[null,{"$f":"INDEX(C22:C23,B22)","v":"kN"}]
[]
[]
[]
[]
[]
[]
[]
[null,null,"Polytrop kurva",null,"Förskjutning för polytropa värden"]
[null,1,"Isothermal ",0,"Förskjutning 0 kolumner"]
["Förskjutningsfaktor",{"$f":"INDEX(D33:D34,B33)","v":0},"Polytropic",3,"Förskjutning 3 kolumner"]
["Väljer y-värden att plotta"]
[]
[]
[null,null,"Length"]
[null,{"$f":"C8","v":1},"mm",1]
["Konverteringsfaktor",{"$f":"INDEX(D39:D40,B39)","v":1},"Inch",{"$f":"1/25.4","v":3.937007874015748E-2}]
[null,{"$f":"INDEX(C39:C40,B39)","v":"mm"}]
[]
[null,null,"Temperature"]
[null,{"$f":"C8","v":1},"°C"]
[null,null,"°F"]
[null,{"$f":"INDEX(C44:C45,B44)","v":"°C"}]
[]
[]
[]
[]
[]
[]
[null,null,"Surrounding Temperature"]
[null,null,"Celcius from Fahrenheit"]
[null,null,"Fahrenheit","Celcius"]
[null,null,{"$f":"Calculator!X20","v":20},{"$f":"(5/9)*(C56-32)","v":-6.666666666666667}]
[]
[null,null,"Surrounding temperature in C°",{"$f":"IF(B44=1,Calculator!X20,'Unit conv'!D56)","v":20}]
[]
[]
[null,null,"Operating temperature"]
[null,null,"Min"]
[null,null,"Fahrenheit from Celcius"]
[null,null,{"$f":"Calculator!K10","v":20.774325052322496},{"$f":"C64*(9/5)+32","v":69.393785094180487}]
[]
[null,null,"MIN Operating min temperature in °C",{"$f":"IF(B44=1,C64,D64)","v":20.774325052322496}]
[]
[null,null,"Max"]
[null,null,"Fahrenheit from Celcius"]
[null,null,{"$f":"Calculator!K15","v":30.774325052322496},{"$f":"C70*(9/5)+32","v":87.393785094180487}]
[]
[null,null,"MAX Operating min temperature in °C",{"$f":"IF(B44=1,C70,D70)","v":30.774325052322496}]
[]
[]
[]
[null,null,"Temperaturgränser temperaturstapeldiagram"]
[null,null,"Celsus",0,100]
[null,null,"Fahrenheit",30,210]
[]
[null,null,"Gränser",{"$f":"INDEX(D77:D78,B44)","v":0},{"$f":"INDEX(E77:E78,B44)","v":100}]
[]
[null,null,"Temperaturgräns, varning"]
[null,null,80,{"$f":"C83*(9/5)+32","v":176}]
[null,null,"Warning_Temperature",{"$f":"INDEX(C83:D83,B44)","v":80},"°C eller °F"]

{"sheet":"Fjäderkurva","index":7,"n_rows":68,"n_cols":20,"rows_kept":68,"cut":false,"hidden":true,"merged":[]}
[]
[]
[]
[]
[]
[null,null,"Vi/Vf = (Ff/Fi)^(1/1,4)"]
[null,null,"Isotermt är Vi/Vf=(Ff/Fi)",null,null,null,null,null,null,"Virtuell slagvolym",null,null,"Vi / Vf","(Vi / Vf)^kappa","Iso t kraft per fj","Diagramförklaring","Diagramförklaring",null,"Diagramförklaring","Diagramförklaring"]
[null,null,null,null,null,null,null,null,null,null,null,null,null,null,"kN eller lbf",{"$f":"IF(Used_Temperature_Unit=\"°C\",\"Isothermal force at 20 °C\",\"Isothermal force at 68 °F\")","v":"Isothermal force at 20 °C"},{"$f":"\"Isothermal force at running temperature\"","v":"Isothermal force at running temperature"},null,{"$f":"IF(Used_Temperature_Unit=\"°C\",\"Polytropic force at 20 °C\",\"Polytropic force at 68 °F\")","v":"Polytropic force at 20 °C"},{"$f":"\"Polytropic force at running temperature\"","v":"Polytropic force at running temperature"}]
[null,null,null,null,null,null,null,null,null,"Kurva"]
[null,null,null,null,null,null,null,null,null,"Part_Of_Stroke","Stroke_Vector_mm","Virtual_Volume_Vector","Volume_Ratio_Vector","Pressure_Factor_Vector","Isothermal_Force_Vector","Total_Isothermal_Force_Vector_20C","Total_Isothermal_Force_Vector_RunningT","Polytropic_Force_Vector","Total_Polytropic_Force_Vector_20C","Total_Polytropic_Force_Vector_RunningT"]
[null,null,null,null,null,null,null,null,null,0,{"$f":"Part_Of_Stroke_Vector*Used_stroke_for_calculation","v":0},{"$f":"Virtual_Volume-Stroke_Vector_mm","v":43.082474226804138},{"$f":"Virtual_Volume/Virtual_Volume_Vector","v":1},{"$f":"Volume_Ratio_Vector^Kappa","v":1},{"$f":"Initial_Force*Volume_Ratio_Vector","v":0.41666666666666669},{"$f":"Isothermal_Force_Vector*User_Number_of_cylinders","v":0.41666666666666669},{"$f":"Total_Isothermal_Force_Vector_20C*Temperature_Factor","v":0.42487816418134605},{"$f":"Initial_Force*Pressure_Factor_Vector","v":0.41666666666666669},{"$f":"User_Number_of_cylinders*Polytropic_Force_Vector","v":0.41666666666666669},{"$f":"Total_Polytropic_Force_Vector_20C*Temperature_Factor","v":0.42487816418134605}]
[null,null,"Used_Stroke_length_in_mm",{"$f":"IF(Length_unit=1,User_Used_Stroke,User_Used_Stroke/Convertion_factor_length)","v":5},"mm","Omräknat till mm om tum är valt",null,null,null,0.1,0.5,42.582474226804138,1.0117419198644233,1.0164772019265593,0.42155913327684308,0.42155913327684308,0.4298670495373067,0.42353216746939976,0.42353216746939976,0.43187896748674792]
[null,null,"Product_Stroke_length_in_chosen_Unit",{"$f":"FLOOR(IF(Length_unit=1,Product_stroke_length_mm,Product_stroke_length_mm*Convertion_factor_length),0.001)","v":7},"mm or inch",null,null,null,null,0.2,1,42.082474226804138,1.0237628613424792,1.0334253701144465,0.42656785889269966,0.42656785889269966,0.43497448508423447,0.43059390421435273,0.43059390421435273,0.43907987407265409]
[null,null,"Used stroke for calculation",{"$f":"IF(Used_Stroke_length_in_mm>Product_stroke_length_mm,Product_stroke_length_mm,Used_Stroke_length_in_mm)","v":5},"mm","Om utnyttjad slagl är större än max sätts max",null,null,null,0.3,1.5,41.582474226804138,1.0360728895500186,1.0508638049053174,0.4316970373125078,0.4316970373125078,0.44020474727007447,0.43785991871054891,0.43785991871054891,0.44648908423279543]
[null,null,null,null,null,null,null,null,null,0.4,2,41.082474226804138,1.0486825595984943,1.0688128426847541,0.43695106649937265,0.43695106649937265,0.44556232073120328,0.44533868445198088,0.44533868445198088,0.45411523845334412]
[null,null,"Filling_Pressure_in_bar",{"$f":"User_filling_pressure/Convertion_factor_pressure","v":150},"bar",null,null,null,null,0.5,2.5,40.582474226804138,1.0616029467801347,1.0872939249795879,0.44233456115838948,0.44233456115838948,0.45105191111745085,0.45303913540816165,0.45303913540816165,0.46196744677085749]
[null,null,null,null,null,null,null,null,null,0.6,3,40.082474226804138,1.0748456790123457,1.1063296730852206,0.44785236625514407,0.44785236625514407,0.4566784588770178,0.46097069711884192,0.46097069711884192,0.47005532047979726]
[null,null,null,null,null,null,null,null,null,0.7,3.5,39.582474226804138,1.088422971741112,1.1259439687411603,0.45350957155879668,0.45350957155879668,0.46244715408616877,0.46914332030881684,0.46914332030881684,0.47838900640980309]
[null,null,null,null,null,null,null,null,null,0.8,4,39.082474226804138,1.1023476655236084,1.146162041428807,0.45931152730150354,0.45931152730150354,0.46836345241726324,0.47756751726200292,0.47756751726200292,0.48697922401661542]
[null,null,"Ff/Fi = Vi/Vf = k   ",{"$f":"Final_force_Fs/Initial_force_Fi","v":1.194},null,"Force factor",null,null,null,0.9,4.5,38.582474226804138,1.116633266533066,1.167010562928168,0.46526386105544421,0.46526386105544421,0.47443309234838876,0.48625440122007002,0.48625440122007002,0.49583730555715921]
[null,null,null,null,null,null,null,null,null,1,5,38.082474226804138,1.1312939902544668,1.1885177498405952,0.47137249593936115,0.47137249593936115,0.48066211372870743,0.49521572910024803,0.49521572910024803,0.50497523964921642]
[null,null,"l = k*s / (k-1)",{"$f":"(Forcefactor*Product_stroke_length_mm)/(Forcefactor-1)","v":43.082474226804138},"mm","Virtuell volym, Viv"]
[]
[null,null,"Virtual_Compressed_volume",{"$f":"Virtual_Volume-Used_stroke_for_calculation","v":38.082474226804138},"mm","Virtuell slutvolym för utnyttjad slagl, Vfvny"]
[]
[null,null,"Volume_Ratio Viny / Vfny ",{"$f":"Virtual_Volume/Virtual_Compressed_volume","v":1.1312939902544668}]
[]
[null,null,"Average_Temperature",{"$f":"IFERROR((Min_Temperature_Interval_in_Celsius+Max_Temperature_Interval_in_Celcius)*0.5,20)","v":25.774325052322496}]
[]
[null,null,"Temperature Factor  (273+T)/(237+20)",{"$f":"(273+Average_Temperature)/(273+20)","v":1.0197075940352305},null,null,null,null,null,null,{"$f":"OFFSET(P8,0,Forskjutningsfaktor_Diagram,1,1)","v":"Isothermal force at 20 °C"},{"$f":"OFFSET(Q8,0,Forskjutningsfaktor_Diagram,1,1)","v":"Isothermal force at running temperature"}]
[]
[null,null,null,null,null,null,null,null,null,"Stroke_Vector_for_Diagram","Force_Vector_For_Diagram_20C","Force_Vector_For_Diagram_RunningT"]
[null,null,null,null,null,null,null,null,null,{"$f":"Stroke_Vector_mm*Convertion_factor_length","v":0},{"$f":"OFFSET(Total_Isothermal_Force_Vector_20C:P21,0,Forskjutningsfaktor_Diagram,11,1)","v":0.41666666666666669},{"$f":"OFFSET(Total_Isothermal_Force_Vector_RunningT,0,Forskjutningsfaktor_Diagram,11,1)","v":0.42487816418134605}]
[null,null,null,null,null,null,null,null,null,0.5,0.42155913327684308,0.4298670495373067]
[null,null,"kappa",1.4,null,null,null,null,null,1,0.42656785889269966,0.43497448508423447]
[null,null,"Pressure_Factor  (Viny / Vfny)^kappa",{"$f":"Volume_Ratio^Kappa","v":1.1885177498405952},"Detta ska tas multiplicerat med Fi eller Pi",null,null,null,null,1.5,0.4316970373125078,0.44020474727007447]
[null,null,null,null,null,null,null,null,null,2,0.43695106649937265,0.44556232073120328]
[null,null,null,null,null,null,null,null,null,2.5,0.44233456115838948,0.45105191111745085]
[null,null,null,null,null,null,null,null,null,3,0.44785236625514407,0.4566784588770178]
[null,null,null,null,null,null,null,null,null,3.5,0.45350957155879668,0.46244715408616877]
[null,null,null,null,null,null,null,null,null,4,0.45931152730150354,0.46836345241726324]
[null,null,"Force_when_compressed",{"$f":"Filling_Pressure_in_bar*Pressure_Factor","v":178.27766247608929},null,null,null,null,null,4.5,0.46526386105544421,0.47443309234838876]
[null,null,null,null,null,null,null,null,null,5,0.47137249593936115,0.48066211372870743,{"$f":"MAX(K43:L43)","v":0.48066211372870743}]
[null,null,"Pressure_Utilisation",{"$f":"Filling_Pressure_in_bar/Maximum_filling_pressure_bar","v":0.83333333333333337}]
[null,null,"Initial_Force",{"$f":"Pressure_Utilisation*Initial_force_Fi*0.001*Convertion_factor_Force","v":0.41666666666666669}]
[null,null,"Total_Initial_Force",{"$f":"$L$33","v":0.42487816418134605}]
[null,null,"Compressed_Force",{"$f":"Initial_force_Fi*Volume_Ratio*Pressure_Utilisation*0.001*Convertion_factor_Force","v":0.47137249593936115},"Isotermt"]
[null,null,"Total_Compressed_Force",{"$f":"$L$43","v":0.48066211372870743}]
[]
[null,null,"Error Messages"]
[null,null,"Part of error message",{"$f":"CONCATENATE(\"Maximum allowable used stroke is \",Product_Stroke_length_in_chosen_Unit,\" \",Used_Length_Unit)","v":"Maximum allowable used stroke is 7 mm"}]
[null,null,"Error_message_Too_long_Used_Stroke_length",{"$f":"IF(Used_Stroke_length_in_mm>Product_stroke_length_mm,D51,\" \")","v":" "}]
[]
[null,null,"Error_message_High_Pressure",{"$f":"IF(User_filling_pressure>Maximum_filling_pressure_bar*Convertion_factor_pressure,\"Filling Pressure to High!\",\"\")","v":""}]
[]
[null,null,"Error_message_High_Temp",{"$f":"IFERROR(IF(Max_Temperature_Interval_in_Celcius>80,\"High temp. Please contact your distributor for advice.\",\"\"),\"\")","v":""}]
[]
[null,null,"Information Messages"]
[null,null,"Information_Message_Max_Filling_Pressure",{"$f":"CONCATENATE(\"Maximum filling pressure is \",Maximum_filling_pressure_bar*FLOOR(Convertion_factor_pressure,0.01),\" \",Used_pressure_unit)","v":"Maximum filling pressure is 180 bar"}]
[]
[null,null,"Information_Message_Running_Temp",{"$f":"CONCATENATE(\"Operating temperature is estimated to be between \",Min_Temperature_interval,\" \",\"and \",Max_Temperature_Inteval,\" \",Used_Temperature_Unit)","v":"Operating temperature is estimated to be between 21 and 31 °C"}]
[]
[null,null,"Information_Message_Force_at_Contact",{"$f":"CONCATENATE(\"Force at contact is \",ROUND(Total_Initial_Force,0),\" \",Used_Force_Unit)","v":"Force at contact is 0 kN"}]
[]
[null,null,"Information_Message_Force_End_Stroke",{"$f":"CONCATENATE(\"Force at \",User_Used_Stroke,\" \",Used_Length_Unit,\" \",\"is \",ROUND(Total_Compressed_Force,0),\" \",Used_Force_Unit)","v":"Force at 5 mm is 0 kN"}]
[]
[null,null,"Headers"]
[null,null,"Header_Force_Diagram",{"$f":"CONCATENATE(\"Total force of \",User_Number_of_cylinders,\" gas spring\",IF(User_Number_of_cylinders>1,\"s\",\"\"),\" in \",Used_Force_Unit)","v":"Total force of 1 gas spring in kN"}]

{"sheet":"Tempdatabladet","index":8,"n_rows":167,"n_cols":41,"rows_kept":167,"cut":false,"hidden":false,"merged":[]}
["Nya kolumner",null,"Gröna kolumner visas i databladet"]
[]
[null,null,null,null,null,"Kolumn F"]
[null,null,null,null,null,"Tagit bort listboxarna/MC"]
[]
[null,null,null,null,null,null,null,null,null,null,null,null,null,null,null,null,null,null,null,null,null,null,null,null,null,null,null,null,null,null,null,null,"Införs i steg"]
[null,null,"T4SC-","CU4",null,"Strokelength","Utilized","Fill pressure","Frequency","Env./Tool","Env./Tool","Env./Tool",null,null,null,"Estimated running",null,{"$f":"P7","v":"Estimated running"},null,null,null,"F° env./tool",null,null,null,null,null,{"$f":"P7","v":"Estimated running"},null,null,null,null,1]
[null,null,null,null,null,null,"strokelength",null,null,"temperature","temperature","temperature","Rörlängd","Röryta","Fjäderfaktor","temperature between:",null,"temperature between:",null,null,null,"temp.",null,null,null,null,null,{"$f":"P8","v":"temperature between:"},null,null,null,null,1]
[null,null,"Spring Size","Spring Size",null,null,"[mm]","[Bar]","[spm]","[°C]","[°F]","[°C]","L (approx)","A","Kf","[°C]","[°C]","[°C]","[°C]","P som [°F]","Q som [°F]","to C°","N + T","U + 10°C","U to F°","V to F°","[°F]","[°F]","[°C]","[°C]",null,null,1]
[{"$f":"CONCATENATE(\"CU4\",\" \",D10)","v":"CU4 420"},null,420,420,null,{"$f":"Product_stroke_length_mm","v":7},{"$f":"Used_stroke_for_calculation","v":5},{"$f":"Filling_Pressure_in_bar","v":150},{"$f":"User_SPM","v":20},{"$f":"Surrounding_temperature_in_C°","v":20},77,{"$f":"5/9*(K10-32)","v":25},{"$f":"39.1+2.146*F10","v":54.122},{"$f":"24.9*PI()*M10*0.01","v":42.337290121799107},{"$f":"0.49+0.017*F10-0.00037*F10^2","v":0.59087000000000001},{"$f":"G10*H10*I10*(G10/F10)^1.1/(150*N10*O10)+J10","v":22.760858595751426},{"$f":"P10+10","v":32.760858595751429},22.760858595751426,32.760858595751429,{"$f":"9/5*R10+32","v":72.969545472352564},{"$f":"9/5*S10+32","v":90.969545472352564},{"$f":"5/9*(K10-32)","v":25},{"$f":"P10+V10","v":47.760858595751429},{"$f":"W10+10","v":57.760858595751429},{"$f":"9/5*W10+32","v":117.96954547235258},{"$f":"9/5*X10+32","v":135.96954547235259},{"$f":"Y10","v":117.96954547235258},135.96954547235259,{"$f":"5/9*(AA10-32)","v":47.760858595751436},{"$f":"5/9*(AB10-32)","v":57.760858595751444},{"$f":"IF(Q10>80,\"High temp. Please contact your distributor for advice\",IF(H10>150,\"Too high charging pressure!\",\"\"))","v":""},{"$f":"AE10","v":""},1,"Samma som CU",null,null,null,null,null,33,43]
[{"$f":"CONCATENATE(\"CU4\",\" \",D11)","v":"CU4 740"},null,740,740,null,7,5,150,20,20,77,{"$f":"5/9*(K11-32)","v":25},{"$f":"45+2*F11","v":59},{"$f":"32*PI()*M11*0.01","v":59.313269299775293},{"$f":"2.5-0.039*F11","v":2.2269999999999999},{"$f":"G11*H11*I11*(G11/F11)^1.1/(150*N11*O11)+J11","v":20.522862001532232},30.522862001532232,20.522862001532232,30.522862001532232,{"$f":"9/5*R11+32","v":68.941151602758026},86.941151602758026,{"$f":"5/9*(K11-32)","v":25},{"$f":"P11+V11","v":45.522862001532232},{"$f":"W11+10","v":55.522862001532232},{"$f":"9/5*W11+32","v":113.94115160275803},131.94115160275803,113.94115160275803,131.94115160275803,{"$f":"5/9*(AA11-32)","v":45.522862001532239},55.522862001532239,"",{"$f":"AE11","v":""},1,"Samma som CU",null,null,null,null,null,30,40]
["CU4 1000",null,1000,1000,null,7,5,150,20,20,77,25,{"$f":"38.9+2.88*F12","v":59.06},{"$f":"37.9*PI()*M12*0.01","v":70.320593143863988},{"$f":"0.8248-0.002*F12","v":0.81079999999999997},21.211331177813268,31.211331177813268,21.211331177813268,31.211331177813268,70.180396120063875,88.180396120063875,25,46.211331177813264,56.211331177813264,115.18039612006388,133.18039612006388,115.18039612006388,133.18039612006388,46.211331177813264,56.211331177813264,"","",1,"Samma som CU",null,null,null,null,null,28,38]
["CU4 1800",null,1800,1800,null,7,5,150,20,20,77,25,{"$f":"46.6+2.535*F13","v":64.344999999999999},{"$f":"50.2*PI()*M13*0.01","v":101.4771812062081},{"$f":"0.8713-0.0118*F13","v":0.78869999999999996},20.862936670790027,30.862936670790027,20.862936670790027,30.862936670790027,69.553286007422059,87.553286007422059,25,45.862936670790027,55.862936670790027,114.55328600742205,132.55328600742206,114.55328600742205,132.55328600742206,45.862936670790027,55.862936670790035,"","",1,"Samma som CU + slagl. 65",null,null,null,null,null,30,40]
["CU4 2900",null,2900,2900,null,7,5,150,20,20,77,25,{"$f":"55+2*F14","v":69},{"$f":"63.2*PI()*M14*0.01","v":136.99857243774372},{"$f":"1.2-0.0181*F14","v":1.0732999999999999},20.469701546037577,30.469701546037577,20.469701546037577,30.469701546037577,68.845462782867642,86.845462782867642,25,45.469701546037577,55.469701546037577,113.84546278286764,131.84546278286763,113.84546278286764,131.84546278286763,45.469701546037584,55.469701546037577,"","",1,"Samma som CU + slagl. 65",null,null,null,null,null,29,39]
["CU4 4700",null,4700,4700,null,7,5,150,20,20,77,25,{"$f":"40+3*F15","v":61},{"$f":"75.2*PI()*M15*0.01","v":144.11113820547101},0.43,21.114533577231278,31.114533577231278,21.114533577231278,31.114533577231278,70.006160439016298,88.006160439016298,25,46.114533577231278,56.114533577231278,115.0061604390163,133.0061604390163,115.0061604390163,133.0061604390163,46.114533577231278,56.114533577231278,"","",1,"Samma som CU + slagl. 65",null,null,null,null,null,27,37]
["CU4 7500",null,7500,7500,null,7,5,150,20,20,77,25,{"$f":"50+3*F16","v":71},{"$f":"95.2*PI()*M16*0.01","v":212.34653064144129},0.3,21.084158392982594,31.084158392982594,21.084158392982594,31.084158392982594,69.951485107368669,87.951485107368669,25,46.084158392982594,56.084158392982594,114.95148510736867,132.95148510736868,114.95148510736867,132.95148510736868,46.084158392982594,56.084158392982602,"","",1,"Samma som CU + slagl. 65",null,null,null,null,null,27,37]
["CU4 11800",null,11800,11800,null,7,5,150,20,20,77,25,{"$f":"60+3*F17","v":81},{"$f":"120.2*PI()*M17*0.01","v":305.87174393880946},{"$f":"0.247-0.0023*F17","v":0.23089999999999999},20.977903202975387,30.977903202975387,20.977903202975387,30.977903202975387,69.760225765355699,87.760225765355699,25,45.977903202975384,55.977903202975384,114.7602257653557,132.7602257653557,114.7602257653557,132.7602257653557,45.977903202975391,55.977903202975391,"","",1,"Samma som CU + slagl. 65",null,null,null,null,null,29,39]
["CU4 18300",null,18300,18300,null,7,5,150,20,20,77,25,{"$f":"70+3*F18","v":91},{"$f":"150.2*PI()*M18*0.01","v":429.3991670779601},{"$f":"0.25-0.0011*F18","v":0.24229999999999999},20.663811159137676,30.663811159137676,20.663811159137676,30.663811159137676,69.194860086447818,87.194860086447818,25,45.66381115913768,55.66381115913768,114.19486008644783,132.19486008644782,114.19486008644783,132.19486008644782,45.663811159137687,55.66381115913768,"","",1,"Samma som CU + slagl. 65",null,null,null,null,null,27,37]
[]
[]
[null,null,"T5-","CX",null,"Strokelength","Utilized","Fill pressure","Frequency","Env./Tool","Env./Tool","Env./Tool",null,null,null,"Estimated running",null,{"$f":"P21","v":"Estimated running"},null,null,null,"F° env./tool",null,null,null,null,null,{"$f":"P21","v":"Estimated running"},null,null,null,null,1]
[null,null,null,null,null,null,"strokelength",null,null,"temperature","temperature","temperature",null,null,null,"temperature between:",null,"temperature between:",null,null,null,"temp.",null,null,null,null,null,{"$f":"P22","v":"temperature between:"},null,null,null,null,1]
[null,null,"Spring Size","Spring Size",null,null,"[mm]","[Bar]","[spm]","[°C]","[°F]","[°C]",null,null,null,"[°C]","[°C]","[°C]",{"$f":"Q23","v":"[°C]"},"P som [°F]","Q som [°F]","to C°","N + T","U + 10°C","U to F°","V to F°","[°F]","[°F]","[°C]","[°C]",null,null,1]
[{"$f":"CONCATENATE(\"CX\",\" \",D24)","v":"CX 500"},null,500,500,null,{"$f":"Product_stroke_length_mm","v":7},{"$f":"Used_stroke_for_calculation","v":5},{"$f":"Filling_Pressure_in_bar","v":150},{"$f":"User_SPM","v":20},{"$f":"Surrounding_temperature_in_C°","v":20},77,25,null,null,null,{"$f":"0.8*(75*(I24/((IF(F24=10,26834,(IF(F24=15,28528,(IF(F24=25,30815,(IF(F24=38,32827,(IF(F24=50,34215,(IF(F24=63,35431,(IF(F24=80,36732,0))))))))))))))*G24^-1.65))*(H24/185)^1.4)+J24","v":{"$error":"#DIV/0!"}},{"$f":"P24+10","v":{"$error":"#DIV/0!"}},{"$error":"#DIV/0!"},{"$f":"Q24","v":{"$error":"#DIV/0!"}},{"$error":"#DIV/0!"},{"$error":"#DIV/0!"},{"$f":"5/9*(K24-32)","v":25},{"$f":"P24+V24","v":{"$error":"#DIV/0!"}},{"$error":"#DIV/0!"},{"$f":"9/5*W24+32","v":{"$error":"#DIV/0!"}},{"$error":"#DIV/0!"},{"$error":"#DIV/0!"},{"$error":"#DIV/0!"},{"$error":"#DIV/0!"},{"$error":"#DIV/0!"},{"$f":"IF(Q24>80,\"High temp. Please contact your distributor for advice\",IF(H24>200,\"Too high charging pressure!\",\"\"))","v":{"$error":"#DIV/0!"}},{"$error":"#DIV/0!"},1,"Värden från Avdo. 0,8 för att korrespondera mot graf i broschyren där hundra grader tillåts",null,null,null,null,null,32,42]
[{"$f":"CONCATENATE(\"CX\",\" \",D25)","v":"CX 1000"},null,1000,1000,null,{"$f":"Product_stroke_length_mm","v":7},{"$f":"Used_stroke_for_calculation","v":5},{"$f":"Filling_Pressure_in_bar","v":150},{"$f":"User_SPM","v":20},{"$f":"Surrounding_temperature_in_C°","v":20},77,25,null,null,null,{"$f":"0.8*(75*(I25/((IF(F25=10,110943,(IF(F25=15,120314,(IF(F25=25,133256,(IF(F25=38,144895,(IF(F25=50,153071,(IF(F25=63,160312,(IF(F25=80,168157,0))))))))))))))*G25^-1.9))*(H25/120)^1.4)+J25","v":{"$error":"#DIV/0!"}},{"$f":"P25+10","v":{"$error":"#DIV/0!"}},{"$error":"#DIV/0!"},{"$f":"Q25","v":{"$error":"#DIV/0!"}},{"$error":"#DIV/0!"},{"$error":"#DIV/0!"},25,{"$error":"#DIV/0!"},{"$error":"#DIV/0!"},{"$error":"#DIV/0!"},{"$error":"#DIV/0!"},{"$error":"#DIV/0!"},{"$error":"#DIV/0!"},{"$error":"#DIV/0!"},{"$error":"#DIV/0!"},{"$f":"IF(Q25>80,\"High temp. Please contact your distributor for advice\",IF(H25>200,\"Too high charging pressure!\",\"\"))","v":{"$error":"#DIV/0!"}},{"$error":"#DIV/0!"},1,"Värden från Avdo. 0,8 för att korrespondera mot graf i broschyren där hundra grader tillåts",null,null,null,null,null,32,42]
["CX 1900",null,1900,1900,null,{"$f":"Product_stroke_length_mm","v":7},{"$f":"Used_stroke_for_calculation","v":5},{"$f":"Filling_Pressure_in_bar","v":150},{"$f":"User_SPM","v":20},{"$f":"Surrounding_temperature_in_C°","v":20},77,25,null,null,null,{"$f":"0.8*(75*(I26/((IF(F26=10,201684,(IF(F26=15,223653,(IF(F26=25,254769,(IF(F26=38,283476,(IF(F26=50,304025,(IF(F26=63,322480,(IF(F26=80,342736,0))))))))))))))*G26^-2.25))*(H26/165)^1.4)+J26","v":{"$error":"#DIV/0!"}},{"$f":"P26+10","v":{"$error":"#DIV/0!"}},{"$error":"#DIV/0!"},{"$f":"Q26","v":{"$error":"#DIV/0!"}},{"$error":"#DIV/0!"},{"$error":"#DIV/0!"},25,{"$error":"#DIV/0!"},{"$error":"#DIV/0!"},{"$error":"#DIV/0!"},{"$error":"#DIV/0!"},{"$error":"#DIV/0!"},{"$error":"#DIV/0!"},{"$error":"#DIV/0!"},{"$error":"#DIV/0!"},{"$f":"IF(Q26>80,\"High temp. Please contact your distributor for advice\",IF(H26>200,\"Too high charging pressure!\",\"\"))","v":{"$error":"#DIV/0!"}},{"$error":"#DIV/0!"},1,"Värden från Avdo. 0,8 för att korrespondera mot graf i broschyren där hundra grader tillåts",null,null,null,null,null,34,44]
[]
[]
[null,null,"T2L-","K",null,"Strokelength","Utilized","Fill pressure","Frequency","Env./Tool","Env./Tool","Env./Tool",null,null,null,"Estimated running",null,{"$f":"P29","v":"Estimated running"},null,null,null,"F° env./tool",null,null,null,null,null,{"$f":"P29","v":"Estimated running"},null,null,null,null,1]
[null,null,null,null,null,null,"strokelength",null,null,"temperature","temperature","temperature","Fjäderfaktor","Tryckfaktor","Slagfaktor","temperature between:",null,"temperature between:",null,null,null,"temp.",null,null,null,null,null,{"$f":"P30","v":"temperature between:"},null,null,null,null,1]
[null,null,"Spring Size","Spring Size",null,null,"[mm]","[Bar]","[spm]","[°C]","[°F]","[°C]","K1","Kp","Ks","[°C]","[°C]","[°C]",{"$f":"Q31","v":"[°C]"},"P som [°F]","Q som [°F]","to C°","N + T","U + 10°C","U to F°","V to F°","[°F]","[°F]","[°C]","[°C]",null,null,1]
["K 500",null,500,"K500",null,{"$f":"Product_stroke_length_mm","v":7},{"$f":"Used_stroke_for_calculation","v":5},{"$f":"Filling_Pressure_in_bar","v":150},{"$f":"User_SPM","v":20},{"$f":"Surrounding_temperature_in_C°","v":20},77,25,{"$f":"0.00000157*F32^2-0.00026*F32+0.0139","v":1.215693E-2},{"$f":"0.2*(H32/150)^2+0.3*(H32/150)+0.5","v":1},{"$f":"0.1554*EXP(1.7*(G32/F32))+0.15","v":0.67336972853071841},{"$f":"F32*I32*M32*N32*O32+J32","v":21.146055211541373},{"$f":"P32+10","v":31.146055211541373},21.146055211541373,{"$f":"Q32","v":31.146055211541373},70.062899380774468,88.062899380774468,25,46.146055211541373,56.146055211541373,115.06289938077447,133.06289938077447,115.06289938077447,133.06289938077447,46.146055211541373,56.146055211541373,{"$f":"IF(Q32>80,\"High temp. Please contact your distributor for advice\",IF(H32>150,\"Too high charging pressure!\",\"\"))","v":""},"",1,"Samma värden som KS idag",null,null,null,null,null,28,38]
["K 750",null,750,"K750",null,{"$f":"Product_stroke_length_mm","v":7},{"$f":"Used_stroke_for_calculation","v":5},{"$f":"Filling_Pressure_in_bar","v":150},{"$f":"User_SPM","v":20},{"$f":"Surrounding_temperature_in_C°","v":20},77,25,{"$f":"0.0000020455*F33^2-0.00037599*F33+0.02","v":1.7468299499999999E-2},{"$f":"0.3*(H33/150)^2+0.3*(H33/150)+0.4","v":1},{"$f":"0.1564*EXP(1.75*(G33/F33))+0.1","v":0.64588963854703196},{"$f":"F33*I33*M33*N33*O33+J33","v":21.579563111012082},{"$f":"P33+10","v":31.579563111012082},21.579563111012082,{"$f":"Q33","v":31.579563111012082},70.843213599821752,88.843213599821752,25,46.579563111012078,56.579563111012078,115.84321359982174,133.84321359982175,115.84321359982174,133.84321359982175,46.579563111012078,56.579563111012085,{"$f":"IF(Q33>80,\"High temp. Please contact your distributor for advice\",IF(H33>150,\"Too high charging pressure!\",\"\"))","v":""},"",1,"Samma värden som KS idag",null,null,null,null,null,27,37]
["K 1500",null,1500,"K1500",null,{"$f":"Product_stroke_length_mm","v":7},{"$f":"Used_stroke_for_calculation","v":5},{"$f":"Filling_Pressure_in_bar","v":150},{"$f":"User_SPM","v":20},{"$f":"Surrounding_temperature_in_C°","v":20},77,25,{"$f":"-0.00000035*F34^2+0.000016*F34+0.0097","v":9.7948500000000008E-3},{"$f":"0.65*(H34/150)^2+0.06*(H34/150)+0.29","v":1},{"$f":"0.0699*EXP(2.6*(G34/F34))+0.059","v":0.50673811930919133},{"$f":"F34*I34*M34*N34*O34+J34","v":20.694879341508187},{"$f":"P34+10","v":30.694879341508187},20.694879341508187,{"$f":"Q34","v":30.694879341508187},69.250782814714739,87.250782814714739,25,45.694879341508184,55.694879341508184,114.25078281471474,132.25078281471474,114.25078281471474,132.25078281471474,45.694879341508191,55.694879341508191,{"$f":"IF(Q34>80,\"High temp. Please contact your distributor for advice\",IF(H34>150,\"Too high charging pressure!\",\"\"))","v":""},"",1,"Samma värden som idag",null,null,null,null,null,31,41]
[]
[]
[null,null,"T2 LCF","LCF",null,"Strokelength","Utilized","Fill pressure","Frequency","Env./Tool","Env./Tool","Env./Tool",null,null,null,"Estimated running",null,{"$f":"P37","v":"Estimated running"},null,null,null,"F° env./tool",null,null,null,null,null,{"$f":"P37","v":"Estimated running"},null,null,null,null,2]
[null,null,null,null,null,null,"strokelength",null,null,"temperature","temperature","temperature","Fjäderfaktor","Tryckfaktor","Slagfaktor","temperature between:",null,"temperature between:",null,null,null,"temp.",null,null,null,null,null,{"$f":"P38","v":"temperature between:"},null,null,null,null,2]
[null,null,"Spring Size","Spring Size",null,null,"[mm]","[Bar]","[spm]","[°C]","[°F]","[°C]","K1","Kp","Ks","[°C]","[°C]","[°C]","[°C]","P som [°F]","Q som [°F]","to C°","N + T","U + 10°C","U to F°","V to F°","[°F]","[°F]","[°C]","[°C]",null,null,2]
[{"$f":"CONCATENATE(\"LCF\",\" \",D40)","v":"LCF 750"},null,750,750,null,{"$f":"Product_stroke_length_mm","v":7},{"$f":"Used_stroke_for_calculation","v":5},{"$f":"Filling_Pressure_in_bar","v":150},{"$f":"User_SPM","v":20},{"$f":"Surrounding_temperature_in_C°","v":20},77,25,{"$f":"-0.0000002*F40^2+0.00005*F40+0.0132","v":1.35402E-2},{"$f":"0.88*(H40/150)+0.12","v":1},{"$f":"0.3551*(G40/F40)^2+0.5449*(G40/F40)+0.1","v":0.67038775510204085},{"$f":"F40*I40*M40*N40*O40+J40-2","v":19.270805799428572},{"$f":"P40+10","v":29.270805799428572},19.270805799428572,29.270805799428572,66.687450438971439,84.687450438971439,25,44.270805799428572,54.270805799428572,111.68745043897144,129.68745043897144,111.68745043897144,129.68745043897144,44.27080579942858,54.27080579942858,{"$f":"IF(Q40>80,\"High temp. Please contact your distributor for advice\",IF(H40>150,\"Too high charging pressure!\",\"\"))","v":""},"",2,"Samma värden som TU",null,null,null,null,null,37,47]
[{"$f":"CONCATENATE(\"LCF\",\" \",D41)","v":"LCF 1500"},null,1500,1500,null,{"$f":"Product_stroke_length_mm","v":7},{"$f":"Used_stroke_for_calculation","v":5},{"$f":"Filling_Pressure_in_bar","v":150},{"$f":"User_SPM","v":20},{"$f":"Surrounding_temperature_in_C°","v":20},77,25,{"$f":"-0.00000015*F41^2+0.000027*F41+0.0145","v":1.4681650000000001E-2},{"$f":"0.88*(H41/150)+0.12","v":1},{"$f":"0.82*(G41/F41)^2+0.075*(G41/F41)+0.1","v":0.571938775510204},{"$f":"F41*I41*M41*N41*O41+J41","v":21.175580689285713},{"$f":"P41+10","v":31.175580689285713},21.175580689285713,31.175580689285713,70.116045240714286,88.116045240714286,25,46.175580689285709,56.175580689285709,115.11604524071429,133.1160452407143,115.11604524071429,133.1160452407143,46.175580689285717,56.175580689285724,{"$f":"IF(Q41>80,\"High temp. Please contact your distributor for advice\",IF(H41>150,\"Too high charging pressure!\",\"\"))","v":""},"",2,"Samma värden som TU",null,null,null,null,null,38,48]
["LCF 3000",null,3000,3000,null,{"$f":"Product_stroke_length_mm","v":7},{"$f":"Used_stroke_for_calculation","v":5},{"$f":"Filling_Pressure_in_bar","v":150},{"$f":"User_SPM","v":20},{"$f":"Surrounding_temperature_in_C°","v":20},77,25,{"$f":"0.00000005*F42^2-0.000034*F42+0.0186","v":1.8364449999999997E-2},{"$f":"0.75*(H42/150)+0.25","v":1},{"$f":"0.82*(G42/F42)^2+0.075*(G42/F42)+0.1","v":0.571938775510204},{"$f":"F42*I42*M42*N42*O42+J42","v":21.470467746428572},{"$f":"P42+10","v":31.470467746428572},21.470467746428572,31.470467746428572,70.646841943571431,88.646841943571431,25,46.470467746428568,56.470467746428568,115.64684194357143,133.64684194357142,115.64684194357143,133.64684194357142,46.470467746428575,56.470467746428568,{"$f":"IF(Q42>80,\"High temp. Please contact your distributor for advice\",IF(H42>150,\"Too high charging pressure!\",\"\"))","v":""},"",2,"Samma värden som TU",null,null,null,null,null,38,48]
["LCF 5000",null,5000,5000,null,{"$f":"Product_stroke_length_mm","v":7},{"$f":"Used_stroke_for_calculation","v":5},{"$f":"Filling_Pressure_in_bar","v":150},{"$f":"User_SPM","v":20},{"$f":"Surrounding_temperature_in_C°","v":20},77,25,{"$f":"-0.000003*F43+0.0155","v":1.5479E-2},{"$f":"0.89*(H43/150)+0.11","v":1},{"$f":"0.82*(G43/F43)^2+0.075*(G43/F43)+0.1","v":0.571938775510204},{"$f":"F43*I43*M43*N43*O43+J43","v":21.239425642857142},{"$f":"P43+10","v":31.239425642857142},21.239425642857142,31.239425642857142,70.230966157142859,88.230966157142859,25,46.239425642857142,56.239425642857142,115.23096615714286,133.23096615714286,115.23096615714286,133.23096615714286,46.23942564285715,56.23942564285715,{"$f":"IF(Q43>80,\"High temp. Please contact your distributor for advice\",IF(H43>150,\"Too high charging pressure!\",\"\"))","v":""},"",2,"Samma värden som TU",null,null,null,null,null,38,48]
[{"$f":"CONCATENATE(\"LCF\",\" \",D44)","v":"LCF 7500"},null,7500,7500,null,{"$f":"Product_stroke_length_mm","v":7},{"$f":"Used_stroke_for_calculation","v":5},{"$f":"Filling_Pressure_in_bar","v":150},{"$f":"User_SPM","v":20},{"$f":"Surrounding_temperature_in_C°","v":20},77,25,{"$f":"-0.000018*F44+0.025","v":2.4874E-2},{"$f":"0.85*(H44/150)+0.15","v":1},{"$f":"0.82*(G44/F44)^2+0.075*(G44/F44)+0.1","v":0.571938775510204},{"$f":"F44*I44*M44*N44*O44+J44","v":21.991696714285712},{"$f":"P44+10","v":31.991696714285712},21.991696714285712,31.991696714285712,71.58505408571429,89.58505408571429,25,46.991696714285709,56.991696714285709,116.58505408571428,134.58505408571426,116.58505408571428,134.58505408571426,46.991696714285709,56.991696714285702,{"$f":"IF(Q44>80,\"High temp. Please contact your distributor for advice\",IF(H44>150,\"Too high charging pressure!\",\"\"))","v":""},"",2,"Samma värden som TU",null,null,null,null,null,44,54]
[]
[]
[null,null,"T2-180","M2",null,"Strokelength","Utilized","Fill pressure","Frequency","Env./Tool","Env./Tool","Env./Tool",null,null,null,"Estimated running",null,{"$f":"P47","v":"Estimated running"},null,null,null,"F° env./tool",null,null,null,null,null,{"$f":"P47","v":"Estimated running"},null,null,null,null,2]
[null,null,null,null,null,null,"strokelength",null,null,"temperature","temperature","temperature",null,"Tryck-och",null,"temperature between:",null,{"$f":"P48","v":"temperature between:"},null,null,null,"temp.",null,null,null,null,null,{"$f":"P48","v":"temperature between:"},null,null,null,null,2]
[null,null,"Spring Size","Spring Size",null,null,"[mm]","[Bar]","[spm]","[°C]","[°F]","[°C]","Slaglängdsfaktor","SPM-faktor","%-faktor","[°C]","[°C]",{"$f":"P49","v":"[°C]"},{"$f":"Q49","v":"[°C]"},"P som [°F]","Q som [°F]","to C°","N + T","U + 10°C","U to F°","V to F°","[°F]","[°F]","[°C]","[°C]",null,null,2]
["M2 180",null,"T2-180","M2",null,{"$f":"Product_stroke_length_mm","v":7},{"$f":"Used_stroke_for_calculation","v":5},{"$f":"Filling_Pressure_in_bar","v":150},{"$f":"User_SPM","v":20},{"$f":"Surrounding_temperature_in_C°","v":20},77,25,{"$f":"-0.000620370414004661*F50^2+0.268331957994321*F50+0.785664791280596","v":2.6335903469546147},{"$f":"(-0.000399199129692736*H50^2+0.164059801283639*H50+1.91164754348779)*(0.00709866427117971*I50^2-0.480884167541125*I50+16.1629135875712)","v":164.59477852243239},{"$f":"0.00174145400538405*(100*G50/F50)^2-0.0253949962177752*(100*G50/F50)+6.92530631030808","v":13.996347424263167},{"$f":"((M50*N50*O50)*0.000200885124608251+3.84189422736609)+J50","v":25.060678295563999},{"$f":"P50+10","v":35.060678295564003},{"$f":"P50","v":25.060678295563999},{"$f":"Q50","v":35.060678295564003},77.109220932015205,95.109220932015205,25,50.060678295564003,60.060678295564003,122.10922093201521,140.10922093201521,122.10922093201521,140.10922093201521,50.060678295564003,60.060678295564003,{"$f":"IF(Q50>80,\"High temp. Please contact your distributor for advice\",IF(H50>180,\"Too high charging pressure!\",\"\"))","v":""},"",2,"Nya tester",null,null,null,null,null,56,66]
[]
[]
[null,null,"T2-200","MC3",null,"Strokelength","Utilized","Fill pressure","Frequency","Env./Tool","Env./Tool","Env./Tool",null,null,null,"Estimated running",null,{"$f":"P53","v":"Estimated running"},null,null,null,"F° env./tool",null,null,null,null,null,{"$f":"P53","v":"Estimated running"},null,null,null,null,2]
[null,null,null,null,null,null,"strokelength",null,null,"temperature","temperature","temperature",null,"Tryck-och",null,"temperature between:",null,{"$f":"P54","v":"temperature between:"},null,null,null,"temp.",null,null,null,null,null,{"$f":"P54","v":"temperature between:"},null,null,null,null,2]
[null,null,"Spring Size","Spring Size",null,null,"[mm]","[Bar]","[spm]","[°C]","[°F]","[°C]","Slaglängdsfaktor","SPM-faktor","%-faktor","[°C]","[°C]",{"$f":"P55","v":"[°C]"},{"$f":"Q55","v":"[°C]"},"P som [°F]","Q som [°F]","to C°","N + T","U + 10°C","U to F°","V to F°","[°F]","[°F]","[°C]","[°C]",null,null,2]
["MC3 200",null,"T2-200","MC3",null,{"$f":"Product_stroke_length_mm","v":7},{"$f":"Used_stroke_for_calculation","v":5},{"$f":"Filling_Pressure_in_bar","v":150},{"$f":"User_SPM","v":20},{"$f":"Surrounding_temperature_in_C°","v":20},77,25,{"$f":"-0.000620370414004661*F56^2+0.268331957994321*F56+0.785664791280596","v":2.6335903469546147},{"$f":"(-0.000399199129692736*H56^2+0.164059801283639*H56+1.91164754348779)*(0.00709866427117971*I56^2-0.480884167541125*I56+16.1629135875712)","v":164.59477852243239},{"$f":"0.00174145400538405*(100*G56/F56)^2-0.0253949962177752*(100*G56/F56)+6.92530631030808","v":13.996347424263167},{"$f":"(((M56*N56*O56)*0.000200885124608251+3.84189422736609)*0.9)+J56","v":24.554610466007599},{"$f":"P56+10","v":34.554610466007603},{"$f":"P56","v":24.554610466007599},{"$f":"Q56","v":34.554610466007603},76.198298838813685,94.198298838813685,25,49.554610466007603,59.554610466007603,121.19829883881368,139.19829883881368,121.19829883881368,139.19829883881368,49.554610466007603,59.554610466007603,{"$f":"IF(Q56>80,\"High temp. Please contact your distributor for advice\",IF(H56>180,\"Too high charging pressure!\",\"\"))","v":""},"",2,"Använd samma som M2",null,null,null,null,null,51,61]
[]
[]
[null,null,"T3-","Power Line X",null,"Strokelength","Utilized","Fill pressure","Frequency","Env./Tool","Env./Tool","Env./Tool",null,null,null,"Estimated running",null,{"$f":"P59","v":"Estimated running"},null,null,null,"F° env./tool",null,null,null,null,null,{"$f":"P59","v":"Estimated running"},null,null,null,null,1]
[null,null,null,null,null,null,"strokelength",null,null,"temperature","temperature","temperature","Fjäderfaktor","Tryckfaktor","Slagfaktor","temperature between:",null,"temperature between:",null,null,null,"temp.",null,null,null,null,null,{"$f":"P60","v":"temperature between:"},null,null,null,null,1]
[null,null,"Spring Size","Spring Size",null,null,"[mm]","[Bar]","[spm]","[°C]","[°F]","[°C]","K1","Kp","Ks","[°C]","[°C]","[°C]","[°C]","P som [°F]","Q som [°F]","to C°","N + T","U + 10°C","U to F°","V to F°","[°F]","[°F]","[°C]","[°C]",null,null,1]
[{"$f":"CONCATENATE(\"X\",\" \",D62)","v":"X 170"},null,170,170,null,{"$f":"Product_stroke_length_mm","v":7},{"$f":"Used_stroke_for_calculation","v":5},{"$f":"Filling_Pressure_in_bar","v":150},{"$f":"User_SPM","v":20},{"$f":"Surrounding_temperature_in_C°","v":20},77,25,{"$f":"0.0125","v":1.2500000000000001E-2},{"$f":"0.88*(H62/180)+0.12","v":0.85333333333333339},{"$f":"(G62/F62)^1.15","v":0.67912975524721897},{"$f":"F62*I62*M62*N62*O62+J62","v":21.014167101169182},{"$f":"P62+10","v":31.014167101169182},21.014167101169182,31.014167101169182,69.825500782104527,87.825500782104527,25,46.014167101169178,56.014167101169178,114.82550078210453,132.82550078210454,114.82550078210453,132.82550078210454,46.014167101169186,56.014167101169193,{"$f":"IF(Q62>80,\"High temp. Please contact your distributor for advice\",IF(H62>180,\"Too high charging pressure!\",\"\"))","v":""},"",1,"Samma värden som idag",null,null,null,null,null,34,44]
[{"$f":"CONCATENATE(\"X\",\" \",D63)","v":"X 320"},null,320,320,null,7,5,150,20,20,77,25,{"$f":"-0.0000681414497203971*F63+0.023229141","v":2.2752150851957219E-2},{"$f":"0.76*(H63/180)+0.24","v":0.87333333333333341},0.67912975524721897,{"$f":"F63*I63*M63*N63*O63+J63-2","v":19.889223285381892},{"$f":"P63+10","v":29.889223285381892},19.889223285381892,29.889223285381892,67.800601913687416,85.800601913687416,25,44.889223285381888,54.889223285381888,112.8006019136874,130.80060191368739,112.8006019136874,130.80060191368739,44.889223285381895,54.889223285381881,{"$f":"IF(Q63>80,\"High temp. Please contact your distributor for advice\",IF(H63>180,\"Too high charging pressure!\",\"\"))","v":""},"",1,"Samma värden som idag",null,null,null,null,null,36,46]
["X 350",null,350,350,null,7,5,150,20,20,77,25,{"$f":"-0.0000557409944506719*F64+0.012735192","v":1.2345005038845296E-2},{"$f":"0.78*(H64/180)+0.22","v":0.87},0.67912975524721897,{"$f":"F64*I64*M64*N64*O64+J64","v":21.021154178517804},31.021154178517804,21.021154178517804,31.021154178517804,69.838077521332053,87.838077521332053,25,46.021154178517804,56.021154178517804,114.83807752133205,132.83807752133205,114.83807752133205,132.83807752133205,46.021154178517811,56.021154178517811,{"$f":"IF(Q64>80,\"High temp. Please contact your distributor for advice\",IF(H64>180,\"Too high charging pressure!\",\"\"))","v":""},"",1,"Samma värden som idag",null,null,null,null,null,31,41]
["X 500",null,500,500,null,7,5,150,20,20,77,25,{"$f":"-0.0000286323189548996*F65+0.01030877","v":1.0108343767315703E-2},{"$f":"0.69*(H65/150)+0.31","v":1},0.67912975524721897,20.961082784011261,30.961082784011261,20.961082784011261,30.961082784011261,69.72994901122027,87.72994901122027,25,45.961082784011261,55.961082784011261,114.72994901122027,132.72994901122027,114.72994901122027,132.72994901122027,45.961082784011261,55.961082784011261,{"$f":"IF(Q65>80,\"High temp. Please contact your distributor for advice\",IF(H65>150,\"Too high charging pressure!\",\"\"))","v":""},"",1,"Samma värden som idag",null,null,null,null,null,32,42]
["X 750",null,750,750,null,7,5,150,20,20,77,25,{"$f":"-5.21759415768633E-06*F66+0.011064444","v":1.1027920840896195E-2},{"$f":"0.7*(H66/150)+0.3","v":1},0.67912975524721897,21.048514485418895,31.048514485418895,21.048514485418895,31.048514485418895,69.887326073754011,87.887326073754011,25,46.048514485418892,56.048514485418892,114.88732607375401,132.88732607375402,114.88732607375401,132.88732607375402,46.048514485418899,56.048514485418906,"","",1,"Samma värden som idag",null,null,null,null,null,34,44]
["X 1000",null,1000,1000,null,7,5,150,20,20,77,25,{"$f":"-3.37582158982632E-06*F67+0.012213964","v":1.2190333248871216E-2},{"$f":"0.79*(H67/150)+0.21","v":1},0.67912975524721897,21.159034524996311,31.159034524996311,21.159034524996311,31.159034524996311,70.086262144993356,88.086262144993356,25,46.159034524996315,56.159034524996315,115.08626214499337,133.08626214499338,115.08626214499337,133.08626214499338,46.159034524996322,56.159034524996329,"","",1,"Samma värden som idag",null,null,null,null,null,36,46]
["X 1500",null,1500,1500,null,7,5,150,20,20,77,25,{"$f":"-0.0000115814333465656*F68+0.0161709","v":1.6089829966574039E-2},{"$f":"0.84*(H68/150)+0.16","v":1},0.67912975524721897,21.529791520203631,31.529791520203631,21.529791520203631,31.529791520203631,70.753624736366532,88.753624736366532,25,46.529791520203631,56.529791520203631,115.75362473636653,133.75362473636653,115.75362473636653,133.75362473636653,46.529791520203631,56.529791520203631,"","",1,"Samma värden som idag",null,null,null,null,null,38,48]
["X 2400",null,2400,2400,null,7,5,150,20,20,77,25,1.5820000000000001E-2,{"$f":"0.87*(H69/150)+0.13","v":1},0.67912975524721897,21.504136581921539,31.504136581921539,21.504136581921539,31.504136581921539,70.707445847458771,88.707445847458771,25,46.504136581921543,56.504136581921543,115.70744584745879,133.70744584745879,115.70744584745879,133.70744584745879,46.50413658192155,56.50413658192155,"","",1,"Samma värden som idag",null,null,null,null,null,39,49]
["X 4200",null,4200,4200,null,7,5,150,20,20,77,25,1.3690000000000001E-2,{"$f":"0.8*(H70/150)+0.2","v":1},0.67912975524721897,21.301620088906819,31.301620088906819,21.301620088906819,31.301620088906819,70.342916160032274,88.342916160032274,25,46.301620088906816,56.301620088906816,115.34291616003227,133.34291616003227,115.34291616003227,133.34291616003227,46.301620088906823,56.301620088906823,"","",1,"Samma värden som idag",null,null,null,null,null,37,47]
["X 6600",null,6600,6600,null,7,5,150,20,20,77,25,1.3390000000000001E-2,{"$f":"0.74*(H71/150)+0.26","v":1},0.67912975524721897,21.273096639186438,31.273096639186438,21.273096639186438,31.273096639186438,70.291573950535593,88.291573950535593,25,46.273096639186434,56.273096639186434,115.29157395053558,133.29157395053556,115.29157395053558,133.29157395053556,46.273096639186434,56.273096639186427,"","",1,"Samma värden som idag",null,null,null,null,null,37,47]
["X 9500",null,9500,9500,null,7,5,150,20,20,77,25,{"$f":"-0.0000191040326040326*F72+0.011165147","v":1.1031418771771773E-2},{"$f":"0.77*(H72/150)+0.23","v":1},0.67912975524721897,21.048847062270411,31.048847062270411,21.048847062270411,31.048847062270411,69.887924712086743,87.887924712086743,25,46.048847062270411,56.048847062270411,114.88792471208674,132.88792471208674,114.88792471208674,132.88792471208674,46.048847062270418,56.048847062270418,"","",1,"Samma värden som idag",null,null,null,null,null,33,43]
["X 20000",null,20000,20000,null,7,5,150,20,20,77,25,{"$f":"0.0000242305296039432*H73*F73*(100*G73/F73)","v":1.8172897202957399},{"$f":"0.000200697723517146*I73*F73*G73/F73*100*0.0121957161724547*F73*I73","v":3.4267134614620587},{"$f":"0.116667676767677*H73","v":17.500151515151551},{"$f":"J73+(O73*N73*M73*0.000233655270520329+4.89453401490754)","v":24.919997588389219},{"$f":"P73+10","v":34.919997588389222},24.919997588389219,34.919997588389222,76.855995659100586,94.8559956591006,25,49.919997588389222,59.919997588389222,121.8559956591006,139.85599565910059,121.8559956591006,139.85599565910059,49.919997588389222,59.919997588389215,"","",2,"Nya tester",null,null,null,null,null,32,42]
[]
[]
[null,null,"T3T-","Power Line XG",null,"Strokelength","Utilized","Fill pressure","Frequency","Env./Tool","Env./Tool","Env./Tool",null,null,null,"Estimated running",null,{"$f":"P76","v":"Estimated running"},null,null,null,"F° env./tool",null,null,null,null,null,{"$f":"P76","v":"Estimated running"},null,null,null,null,1]
[null,null,null,null,null,null,"strokelength",null,null,"temperature","temperature","temperature","Fjäderfaktor","Tryckfaktor","Slagfaktor","temperature between:",null,"temperature between:",null,null,null,"temp.",null,null,null,null,null,{"$f":"P77","v":"temperature between:"},null,null,null,null,1]
[null,null,"Spring Size","Spring Size",null,null,"[mm]","[Bar]","[spm]","[°C]","[°F]","[°C]","K1","Kp","Ks","[°C]","[°C]","[°C]","[°C]","P som [°F]","Q som [°F]","to C°","N + T","U + 10°C","U to F°","V to F°","[°F]","[°F]","[°C]","[°C]",null,null,1]
[{"$f":"CONCATENATE(\"XG\",\" \",D79)","v":"XG 350"},null,350,350,null,{"$f":"Product_stroke_length_mm","v":7},{"$f":"Used_stroke_for_calculation","v":5},{"$f":"Filling_Pressure_in_bar","v":150},{"$f":"User_SPM","v":20},{"$f":"Surrounding_temperature_in_C°","v":20},77,{"$f":"5/9*(K79-32)","v":25},{"$f":"-0.0000557409944506719*F79+0.012735192","v":1.2345005038845296E-2},{"$f":"0.78*(H79/180)+0.22","v":0.87},{"$f":"(G79/F79)^1.15","v":0.67912975524721897},{"$f":"F79*I79*M79*N79*O79+J79","v":21.021154178517804},{"$f":"P79+10","v":31.021154178517804},21.021154178517804,31.021154178517804,{"$f":"9/5*R79+32","v":69.838077521332053},87.838077521332053,25,46.021154178517804,{"$f":"W79+10","v":56.021154178517804},114.83807752133205,132.83807752133205,{"$f":"Y79","v":114.83807752133205},132.83807752133205,{"$f":"5/9*(AA79-32)","v":46.021154178517811},56.021154178517811,{"$f":"IF(Q79>80,\"High temp. Please contact your distributor for advice\",IF(H79>180,\"Too high charging pressure!\",\"\"))","v":""},{"$f":"AE79","v":""},1,"Samma värden som X 350",null,null,null,null,null,31,41]
[{"$f":"CONCATENATE(\"XG\",\" \",D80)","v":"XG 500"},null,500,500,null,7,5,150,20,20,77,25,{"$f":"-0.0000286323189548996*F80+0.01030877","v":1.0108343767315703E-2},{"$f":"0.69*(H80/150)+0.31","v":1},0.67912975524721897,20.961082784011261,30.961082784011261,20.961082784011261,30.961082784011261,69.72994901122027,87.72994901122027,25,45.961082784011261,55.961082784011261,114.72994901122027,132.72994901122027,114.72994901122027,132.72994901122027,45.961082784011261,55.961082784011261,{"$f":"IF(Q80>80,\"High temp. Please contact your distributor for advice\",IF(H80>150,\"Too high charging pressure!\",\"\"))","v":""},"",1,"Samma värden som X 500",null,null,null,null,null,32,42]
["XG 750",null,750,750,null,7,5,150,20,20,77,25,{"$f":"-5.21759415768633E-06*F81+0.011064444","v":1.1027920840896195E-2},{"$f":"0.7*(H81/150)+0.3","v":1},0.67912975524721897,21.048514485418895,31.048514485418895,21.048514485418895,31.048514485418895,69.887326073754011,87.887326073754011,25,46.048514485418892,56.048514485418892,114.88732607375401,132.88732607375402,114.88732607375401,132.88732607375402,46.048514485418899,56.048514485418906,"","",1,"Samma värden som X 750",null,null,null,null,null,34,44]
["XG 1000",null,1000,1000,null,7,5,150,20,20,77,25,{"$f":"-3.37582158982632E-06*F82+0.012213964","v":1.2190333248871216E-2},{"$f":"0.79*(H82/150)+0.21","v":1},0.67912975524721897,21.159034524996311,31.159034524996311,21.159034524996311,31.159034524996311,70.086262144993356,88.086262144993356,25,46.159034524996315,56.159034524996315,115.08626214499337,133.08626214499338,115.08626214499337,133.08626214499338,46.159034524996322,56.159034524996329,"","",1,"Samma värden som X 1000",null,null,null,null,null,36,46]
["XG 1500",null,1500,1500,null,7,5,150,20,20,77,25,{"$f":"-0.0000115814333465656*F83+0.0161709","v":1.6089829966574039E-2},{"$f":"0.84*(H83/150)+0.16","v":1},0.67912975524721897,21.529791520203631,31.529791520203631,21.529791520203631,31.529791520203631,70.753624736366532,88.753624736366532,25,46.529791520203631,56.529791520203631,{"$f":"9/5*W83+32","v":115.75362473636653},133.75362473636653,115.75362473636653,133.75362473636653,46.529791520203631,56.529791520203631,"","",1,"Samma värden som X 1500",null,null,null,null,null,38,48]
["XG 2400",null,2400,2400,null,7,5,150,20,20,77,25,1.5820000000000001E-2,{"$f":"0.87*(H84/150)+0.13","v":1},0.67912975524721897,21.504136581921539,31.504136581921539,21.504136581921539,31.504136581921539,70.707445847458771,88.707445847458771,25,46.504136581921543,56.504136581921543,115.70744584745879,133.70744584745879,115.70744584745879,133.70744584745879,46.50413658192155,56.50413658192155,"","",1,"Samma värden som X 2400",null,null,null,null,null,39,49]
["XG 4200",null,4200,4200,null,7,5,150,20,20,77,25,1.3690000000000001E-2,{"$f":"0.8*(H85/150)+0.2","v":1},0.67912975524721897,21.301620088906819,31.301620088906819,21.301620088906819,31.301620088906819,70.342916160032274,88.342916160032274,25,46.301620088906816,56.301620088906816,115.34291616003227,133.34291616003227,115.34291616003227,133.34291616003227,46.301620088906823,56.301620088906823,"","",1,"Samma värden som X 4200",null,null,null,null,null,37,47]
["XG 6600",null,6600,6600,null,7,5,150,20,20,77,25,1.3390000000000001E-2,{"$f":"0.74*(H86/150)+0.26","v":1},0.67912975524721897,21.273096639186438,31.273096639186438,21.273096639186438,31.273096639186438,70.291573950535593,88.291573950535593,25,46.273096639186434,56.273096639186434,115.29157395053558,133.29157395053556,115.29157395053558,133.29157395053556,46.273096639186434,56.273096639186427,"","",1,"Samma värden som X 6600",null,null,null,null,null,37,47]
[null,null,9500,"finns ej",null,7,5,150,20,20,77,25,{"$f":"-0.0000191040326040326*F87+0.011165147","v":1.1031418771771773E-2},{"$f":"0.77*(H87/150)+0.23","v":1},0.67912975524721897,21.048847062270411,31.048847062270411,21.048847062270411,31.048847062270411,69.887924712086743,87.887924712086743,25,46.048847062270411,56.048847062270411,114.88792471208674,132.88792471208674,114.88792471208674,132.88792471208674,46.048847062270418,56.048847062270418,"","",3,"Samma värden som  X9500",null,null,null,null,null,33,43]
[]
[]
[null,null,"T2-50","R12",null,"Strokelength","Utilized","Fill pressure","Frequency","Env./Tool","Env./Tool","Env./Tool",null,null,null,"Estimated running",null,null,null,null,null,"F° env./tool",null,null,null,null,null,{"$f":"P90","v":"Estimated running"},null,null,null,null,3]
[null,null,null,null,null,null,"strokelength",null,null,"temperature","temperature","temperature",null,"Tryck-och",null,"temperature between:",null,null,null,null,null,"temp.",null,null,null,null,null,{"$f":"P91","v":"temperature between:"},null,null,null,null,3]
[null,null,"Spring Size","Spring Size",null,null,"[mm]","[Bar]","[spm]","[°C]","[°F]","[°C]","Slaglängdsfaktor","SPM-faktor","%-faktor","[°C]","[°C]",null,null,"P som [°F]","Q som [°F]","to C°","N + T","U + 10°C","U to F°","V to F°","[°F]","[°F]","[°C]","[°C]",null,null,3]
["R12",null,"T2-50","R12",null,{"$f":"Product_stroke_length_mm","v":7},{"$f":"Used_stroke_for_calculation","v":5},{"$f":"Filling_Pressure_in_bar","v":150},{"$f":"User_SPM","v":20},{"$f":"Surrounding_temperature_in_C°","v":20},77,25,{"$f":"0*F93^2+0.0773842904727491*F93+1.38869038428296","v":1.9303804175922039},{"$f":"(0*H93^2+0.0218685433000524*H93+3.25496045048892)*(0.00155475011645089*I93^2-0.0694414388077009*I93+3.14993259505957)","v":15.573506818004473},{"$f":"0.0860769264525189*(100*G93/F93)-0.119238195541514","v":6.0291136939241214},{"$f":"((M93*N93*O93)*0.00491291957951706-0.116151420334139)+J93","v":20.774325052322496},{"$f":"P93+10","v":30.774325052322496},{"$f":"P93","v":20.774325052322496},{"$f":"Q93","v":30.774325052322496},69.393785094180487,87.393785094180487,{"$f":"5/9*(K93-32)","v":25},{"$f":"P93+V93","v":45.774325052322496},55.774325052322496,114.3937850941805,132.39378509418049,114.3937850941805,132.39378509418049,45.774325052322503,55.774325052322496,{"$f":"IF(Q93>80,\"High temp. Please contact your distributor for advice\",IF(H93>180,\"Too high charging pressure!\",\"\"))","v":""},"",3,"Nya tester",null,null,null,null,null,28,38]
[]
[]
[null,null,"T2-70","R15",null,"Strokelength","Utilized","Fill pressure","Frequency","Env./Tool","Env./Tool","Env./Tool",null,null,null,"Estimated running",null,null,null,null,null,"F° env./tool",null,null,null,null,null,{"$f":"P96","v":"Estimated running"},null,null,null,null,3]
[null,null,null,null,null,null,"strokelength",null,null,"temperature","temperature","temperature",null,"Tryck-och",null,"temperature between:",null,null,null,null,null,"temp.",null,null,null,null,null,{"$f":"P97","v":"temperature between:"},null,null,null,null,3]
[null,null,"Spring Size","Spring Size",null,null,"[mm]","[Bar]","[spm]","[°C]","[°F]","[°C]","Slaglängdsfaktor","SPM-faktor","%-faktor","[°C]","[°C]",null,null,"P som [°F]","Q som [°F]","to C°","N + T","U + 10°C","U to F°","V to F°","[°F]","[°F]","[°C]","[°C]",null,null,3]
["R15",null,"T2-70","R15",null,{"$f":"Product_stroke_length_mm","v":7},{"$f":"Used_stroke_for_calculation","v":5},{"$f":"Filling_Pressure_in_bar","v":150},{"$f":"User_SPM","v":20},{"$f":"Surrounding_temperature_in_C°","v":20},77,25,{"$f":"0*F99^2+0.101700563349931*F99+1.05952116662376","v":1.771425110073277},{"$f":"(0*H99^2+0.025631766517952*H99+3.91514433290844)*(0.000827721825636666*I99^2+0.00507305883455402*I99+3.03783330199938)","v":26.929858974447502},{"$f":"0.0859722222222222*(100*G99/F99)+1.01562037037037","v":7.1564933862433842},{"$f":"((M99*N99*O99)*0.0028145556115581+0.145637978570093)+J99","v":21.106513177580119},{"$f":"P99+10","v":31.106513177580119},{"$f":"P99","v":21.106513177580119},{"$f":"Q99","v":31.106513177580119},69.991723719644213,87.991723719644213,25,46.106513177580119,56.106513177580119,114.99172371964421,132.9917237196442,114.99172371964421,132.9917237196442,46.106513177580119,56.106513177580112,{"$f":"IF(Q99>80,\"High temp. Please contact your distributor for advice\",IF(H99>180,\"Too high charging pressure!\",\"\"))","v":""},"",3,"Nya tester",null,null,null,null,null,29,39]
[]
[]
[null,null,"T2-90","R19",null,"Strokelength","Utilized","Fill pressure","Frequency","Env./Tool","Env./Tool","Env./Tool",null,null,null,"Estimated running",null,{"$f":"P102","v":"Estimated running"},null,null,null,"F° env./tool",null,null,null,null,null,{"$f":"P102","v":"Estimated running"},null,null,null,null,2]
[null,null,null,null,null,null,"strokelength",null,null,"temperature","temperature","temperature",null,"Tryck-och",null,"temperature between:",null,{"$f":"P103","v":"temperature between:"},null,null,null,"temp.",null,null,null,null,null,{"$f":"P103","v":"temperature between:"},null,null,null,null,2]
[null,null,"Spring Size","Spring Size",null,null,"[mm]","[Bar]","[spm]","[°C]","[°F]","[°C]","Slaglängdsfaktor","SPM-faktor","%-faktor","[°C]","[°C]",{"$f":"P104","v":"[°C]"},{"$f":"Q104","v":"[°C]"},"P som [°F]","Q som [°F]","to C°","N + T","U + 10°C","U to F°","V to F°","[°F]","[°F]","[°C]","[°C]",null,null,2]
["R19",null,"T2-90","R19",null,{"$f":"Product_stroke_length_mm","v":7},{"$f":"Used_stroke_for_calculation","v":5},{"$f":"Filling_Pressure_in_bar","v":150},{"$f":"User_SPM","v":20},{"$f":"Surrounding_temperature_in_C°","v":20},77,25,{"$f":"-0.000305883384051968*F105^2+0.156486863440078*F105+1.29999288234444","v":2.3804126406064396},{"$f":"(0*H105^2+0.02389494890977*H105+6.72599823905976)*(0.00227350762618537*I105^2-0.03*I105+3.13727121454514)","v":35.536040857820566},{"$f":"0.0991536412606766*(100*G105/F105)+2.0166981641606","v":9.0991011113517857},{"$f":"((M105*N105*O105)*0.000754142112906586+0.237377105445892)+J105","v":20.817838008013222},{"$f":"P105+10","v":30.817838008013222},{"$f":"P105","v":20.817838008013222},{"$f":"R105+10","v":30.817838008013222},69.472108414423801,87.472108414423801,25,45.817838008013226,55.817838008013226,114.47210841442381,132.47210841442381,114.47210841442381,132.47210841442381,45.817838008013233,55.817838008013233,{"$f":"IF(Q105>80,\"High temp. Please contact your distributor for advice\",IF(H105>180,\"Too high charging pressure!\",\"\"))","v":""},{"$f":"AE105","v":""},2,"Nya tester",null,null,null,null,null,27,37]
[]
[]
[null,null,"NPL-","TL",null,"Strokelength","Utilized","Fill pressure","Frequency","Env./Tool","Env./Tool","Env./Tool",null,null,null,"Estimated running",null,{"$f":"P108","v":"Estimated running"},null,null,null,"F° env./tool",null,null,null,null,null,{"$f":"P108","v":"Estimated running"},null,null,null,null,1]
[null,null,null,null,null,null,"strokelength",null,null,"temperature","temperature","temperature","Fjäderfaktor","Tryckfaktor","Slagfaktor","temperature between:",null,"temperature between:",null,null,null,"temp.",null,null,null,null,null,{"$f":"P109","v":"temperature between:"},null,null,null,null,1]
[null,null,"Spring Size","Spring Size",null,null,"[mm]","[Bar]","[spm]","[°C]","[°F]","[°C]","K1","Kp","Ks","[°C]","[°C]","[°C]","[°C]","P som [°F]","Q som [°F]","to C°","N + T","U + 10°C","U to F°","V to F°","[°F]","[°F]","[°C]","[°C]",null,null,1]
[{"$f":"CONCATENATE(\"TL\",\" \",D111)","v":"TL 750"},null,750,750,null,{"$f":"Product_stroke_length_mm","v":7},{"$f":"Used_stroke_for_calculation","v":5},{"$f":"Filling_Pressure_in_bar","v":150},{"$f":"User_SPM","v":20},{"$f":"Surrounding_temperature_in_C°","v":20},77,25,{"$f":"-0.0000002*F111^2+0.00005*F111+0.0132","v":1.35402E-2},{"$f":"0.88*(H111/150)+0.12","v":1},{"$f":"0.3551*(G111/F111)^2+0.5449*(G111/F111)+0.1","v":0.67038775510204085},{"$f":"F111*I111*M111*N111*O111+J111-2","v":19.270805799428572},{"$f":"P111+10","v":29.270805799428572},19.270805799428572,29.270805799428572,66.687450438971439,84.687450438971439,25,44.270805799428572,54.270805799428572,111.68745043897144,129.68745043897144,111.68745043897144,129.68745043897144,44.27080579942858,54.27080579942858,{"$f":"IF(Q111>80,\"High temp. Please contact your distributor for advice\",IF(H111>150,\"Too high charging pressure!\",\"\"))","v":""},{"$f":"AE111","v":""},1,"Samma värden som TU 750",null,null,null,null,null,34,44]
[{"$f":"CONCATENATE(\"TL\",\" \",D112)","v":"TL 1500"},null,1500,1500,null,{"$f":"Product_stroke_length_mm","v":7},{"$f":"Used_stroke_for_calculation","v":5},{"$f":"Filling_Pressure_in_bar","v":150},{"$f":"User_SPM","v":20},{"$f":"Surrounding_temperature_in_C°","v":20},77,25,{"$f":"-0.00000015*F112^2+0.000027*F112+0.0145","v":1.4681650000000001E-2},{"$f":"0.88*(H112/150)+0.12","v":1},{"$f":"0.82*(G112/F112)^2+0.075*(G112/F112)+0.1","v":0.571938775510204},{"$f":"F112*I112*M112*N112*O112+J112","v":21.175580689285713},{"$f":"P112+10","v":31.175580689285713},21.175580689285713,31.175580689285713,70.116045240714286,88.116045240714286,25,46.175580689285709,56.175580689285709,115.11604524071429,133.1160452407143,115.11604524071429,133.1160452407143,46.175580689285717,56.175580689285724,{"$f":"IF(Q112>80,\"High temp. Please contact your distributor for advice\",IF(H112>150,\"Too high charging pressure!\",\"\"))","v":""},{"$f":"AE112","v":""},1,"Samma värden som TU 1500",null,null,null,null,null,38,48]
["TL 3000",null,3000,3000,null,{"$f":"Product_stroke_length_mm","v":7},{"$f":"Used_stroke_for_calculation","v":5},{"$f":"Filling_Pressure_in_bar","v":150},{"$f":"User_SPM","v":20},{"$f":"Surrounding_temperature_in_C°","v":20},77,25,{"$f":"0.00000005*F113^2-0.000034*F113+0.0186","v":1.8364449999999997E-2},{"$f":"0.75*(H113/150)+0.25","v":1},{"$f":"0.82*(G113/F113)^2+0.075*(G113/F113)+0.1","v":0.571938775510204},{"$f":"F113*I113*M113*N113*O113+J113","v":21.470467746428572},{"$f":"P113+10","v":31.470467746428572},21.470467746428572,31.470467746428572,70.646841943571431,88.646841943571431,25,46.470467746428568,56.470467746428568,115.64684194357143,133.64684194357142,115.64684194357143,133.64684194357142,46.470467746428575,56.470467746428568,{"$f":"IF(Q113>80,\"High temp. Please contact your distributor for advice\",IF(H113>150,\"Too high charging pressure!\",\"\"))","v":""},{"$f":"AE113","v":""},1,"Samma värden som TU 3000",null,null,null,null,null,47,57]
["TL 5000",null,5000,5000,null,{"$f":"Product_stroke_length_mm","v":7},{"$f":"Used_stroke_for_calculation","v":5},{"$f":"Filling_Pressure_in_bar","v":150},{"$f":"User_SPM","v":20},{"$f":"Surrounding_temperature_in_C°","v":20},77,25,{"$f":"-0.000003*F114+0.0155","v":1.5479E-2},{"$f":"0.89*(H114/150)+0.11","v":1},{"$f":"0.82*(G114/F114)^2+0.075*(G114/F114)+0.1","v":0.571938775510204},{"$f":"F114*I114*M114*N114*O114+J114","v":21.239425642857142},{"$f":"P114+10","v":31.239425642857142},21.239425642857142,31.239425642857142,70.230966157142859,88.230966157142859,25,46.239425642857142,56.239425642857142,115.23096615714286,133.23096615714286,115.23096615714286,133.23096615714286,46.23942564285715,56.23942564285715,{"$f":"IF(Q114>80,\"High temp. Please contact your distributor for advice\",IF(H114>150,\"Too high charging pressure!\",\"\"))","v":""},{"$f":"AE114","v":""},1,"Samma värden som TU 5000",null,null,null,null,null,38,48]
["TL 7500",null,7500,7500,null,{"$f":"Product_stroke_length_mm","v":7},{"$f":"Used_stroke_for_calculation","v":5},{"$f":"Filling_Pressure_in_bar","v":150},{"$f":"User_SPM","v":20},{"$f":"Surrounding_temperature_in_C°","v":20},77,25,{"$f":"-0.000018*F115+0.025","v":2.4874E-2},{"$f":"0.85*(H115/150)+0.15","v":1},{"$f":"0.82*(G115/F115)^2+0.075*(G115/F115)+0.1","v":0.571938775510204},{"$f":"F115*I115*M115*N115*O115+J115","v":21.991696714285712},{"$f":"P115+10","v":31.991696714285712},21.991696714285712,31.991696714285712,71.58505408571429,89.58505408571429,25,46.991696714285709,56.991696714285709,116.58505408571428,134.58505408571426,116.58505408571428,134.58505408571426,46.991696714285709,56.991696714285702,{"$f":"IF(Q115>80,\"High temp. Please contact your distributor for advice\",IF(H115>150,\"Too high charging pressure!\",\"\"))","v":""},{"$f":"AE115","v":""},1,"Samma värden som TU 7500",null,null,null,null,null,44,54]
[]
[null,null,null,null,null,null,null,null,null,null,null,null,null,"Tryck-och"]
[null,null,"NP-","TU",null,"Strokelength","Utilized","Fill pressure","Frequency","Env./Tool","Env./Tool","Env./Tool","Slaglängdsfaktor","SPM-faktor","%-faktor","Estimated running",null,{"$f":"P118","v":"Estimated running"},null,null,null,"F° env./tool",null,null,null,null,null,{"$f":"P118","v":"Estimated running"},null,null,null,null,1]
[null,null,null,null,null,null,"strokelength",null,null,"temperature","temperature","temperature","Fjäderfaktor","Tryckfaktor","Slagfaktor","temperature between:",null,"temperature between:",null,null,null,"temp.",null,null,null,null,null,{"$f":"P119","v":"temperature between:"},null,null,null,null,1]
[null,null,"Spring Size","Spring Size",null,null,"[mm]","[Bar]","[spm]","[°C]","[°F]","[°C]","K1","Kp","Ks","[°C]","[°C]","[°C]","[°C]","P som [°F]","Q som [°F]","to C°","N + T","U + 10°C","U to F°","V to F°","[°F]","[°F]","[°C]","[°C]",null,null,1]
[{"$f":"CONCATENATE(\"TU\",\" \",D121)","v":"TU 250"},null,250,250,null,{"$f":"Product_stroke_length_mm","v":7},{"$f":"Used_stroke_for_calculation","v":5},{"$f":"Filling_Pressure_in_bar","v":150},{"$f":"User_SPM","v":20},{"$f":"Surrounding_temperature_in_C°","v":20},77,25,{"$f":"0*F121^2+0.191028214047924*F121+1.19489445411071","v":2.5320919524461782},{"$f":"(0*H121^2+0.0198307891272208*H121+11.9649416367658)*(0*I121^2+0.0630821558264525*I121+9.92754833295433)","v":167.16159707648865},{"$f":"0.0557716256805885*(100*G121/F121)+9.77007422382933","v":13.753761772442793},{"$f":"((M121*N121*O121)*0.000375660733019535-0.345071041185781)+J121","v":21.841850911036278},{"$f":"P121+10","v":31.841850911036278},21.841850911036278,31.841850911036278,71.315331639865292,89.315331639865292,25,46.841850911036275,56.841850911036275,116.31533163986529,134.31533163986529,116.31533163986529,134.31533163986529,46.841850911036275,56.841850911036275,{"$f":"IF(Q121>80,\"High temp. Please contact your distributor for advice\",IF(H121>150,\"Too high charging pressure!\",\"\"))","v":""},{"$f":"AE121","v":""},1,"Nya tester",null,null,null,null,null,42,52]
[{"$f":"CONCATENATE(\"TU\",\" \",D122)","v":"TU 500"},null,500,500,null,7,5,150,20,20,77,25,{"$f":"-0.00000013726*F122^2-0.0000076261*F122+0.0133","v":1.323989156E-2},{"$f":"0.1645*EXP(1.7*(H122/150))+0.1","v":1.0004643459391245},{"$f":"0.496*(G122/F122)^2+0.4572*(G122/F122)+0.05","v":0.62963265306122451},{"$f":"(F122*I122*M122*N122*O122)+J122","v":21.167619454593453},{"$f":"P122+10","v":31.167619454593453},21.167619454593453,31.167619454593453,70.101715018268209,88.101715018268209,25,46.167619454593449,56.167619454593449,115.10171501826821,133.10171501826821,115.10171501826821,133.10171501826821,46.167619454593449,56.167619454593449,"","",1,"Samma värden som idag",null,null,null,null,null,29,39]
["TU 750",null,750,750,null,7,5,150,20,20,77,25,{"$f":"-0.0000002*F123^2+0.00005*F123+0.0132","v":1.35402E-2},{"$f":"0.88*(H123/150)+0.12","v":1},{"$f":"0.3551*(G123/F123)^2+0.5449*(G123/F123)+0.1","v":0.67038775510204085},{"$f":"F123*I123*M123*N123*O123+J123-2","v":19.270805799428572},{"$f":"P123+10","v":29.270805799428572},19.270805799428572,29.270805799428572,66.687450438971439,84.687450438971439,25,44.270805799428572,54.270805799428572,111.68745043897144,129.68745043897144,111.68745043897144,129.68745043897144,44.27080579942858,54.27080579942858,"","",1,"Samma värden som idag",null,null,null,null,null,33,43]
["TU 1500",null,1500,1500,null,7,5,150,20,20,77,25,{"$f":"-0.00000015*F124^2+0.000027*F124+0.0145","v":1.4681650000000001E-2},{"$f":"0.88*(H124/150)+0.12","v":1},{"$f":"0.82*(G124/F124)^2+0.075*(G124/F124)+0.1","v":0.571938775510204},{"$f":"F124*I124*M124*N124*O124+J124","v":21.175580689285713},31.175580689285713,21.175580689285713,31.175580689285713,70.116045240714286,88.116045240714286,25,46.175580689285709,56.175580689285709,115.11604524071429,133.1160452407143,115.11604524071429,133.1160452407143,46.175580689285717,56.175580689285724,"","",1,"Samma värden som idag",null,null,null,null,null,38,48]
["TU 3000",null,3000,3000,null,7,5,150,20,20,77,25,{"$f":"0.00000005*F125^2-0.000034*F125+0.0186","v":1.8364449999999997E-2},{"$f":"0.75*(H125/150)+0.25","v":1},{"$f":"0.82*(G125/F125)^2+0.075*(G125/F125)+0.1","v":0.571938775510204},{"$f":"F125*I125*M125*N125*O125+J125","v":21.470467746428572},31.470467746428572,21.470467746428572,31.470467746428572,70.646841943571431,88.646841943571431,25,46.470467746428568,56.470467746428568,115.64684194357143,133.64684194357142,115.64684194357143,133.64684194357142,46.470467746428575,56.470467746428568,"","",1,"Samma värden som idag",null,null,null,null,null,38,48]
["TU 5000",null,5000,5000,null,7,5,150,20,20,77,25,{"$f":"-0.000003*F126+0.0155","v":1.5479E-2},{"$f":"0.89*(H126/150)+0.11","v":1},{"$f":"0.82*(G126/F126)^2+0.075*(G126/F126)+0.1","v":0.571938775510204},{"$f":"F126*I126*M126*N126*O126+J126","v":21.239425642857142},31.239425642857142,21.239425642857142,31.239425642857142,70.230966157142859,88.230966157142859,25,46.239425642857142,56.239425642857142,115.23096615714286,133.23096615714286,115.23096615714286,133.23096615714286,46.23942564285715,56.23942564285715,"","",1,"Samma värden som idag",null,null,null,null,null,38,48]
["TU 7500",null,7500,7500,null,7,5,150,20,20,77,25,{"$f":"-0.000018*F127+0.025","v":2.4874E-2},{"$f":"0.85*(H127/150)+0.15","v":1},{"$f":"0.82*(G127/F127)^2+0.075*(G127/F127)+0.1","v":0.571938775510204},{"$f":"F127*I127*M127*N127*O127+J127","v":21.991696714285712},31.991696714285712,21.991696714285712,31.991696714285712,71.58505408571429,89.58505408571429,25,46.991696714285709,56.991696714285709,116.58505408571428,134.58505408571426,116.58505408571428,134.58505408571426,46.991696714285709,56.991696714285702,"","",1,"Samma värden som idag",null,null,null,null,null,44,54]
["TU 10000",null,10000,10000,null,7,5,150,20,20,77,25,{"$f":"-0.00000004*F128^2+0.000015*F128+0.0145","v":1.4603040000000001E-2},{"$f":"0.9*(H128/150)+0.1","v":1},{"$f":"0.82*(G128/F128)^2+0.075*(G128/F128)+0.1","v":0.571938775510204},{"$f":"F128*I128*M128*N128*O128+J128","v":21.169286274285714},31.169286274285714,21.169286274285714,31.169286274285714,70.104715293714293,88.104715293714293,25,46.16928627428571,56.16928627428571,115.10471529371428,133.10471529371426,115.10471529371428,133.10471529371426,46.16928627428571,56.169286274285703,"","",1,"Samma värden som idag",null,null,null,null,null,38,48]
[]
[]
[null,null,"Finns ej ","TUR",null,"Strokelength","Utilized","Fill pressure","Frequency","Env./Tool","Env./Tool","Env./Tool",null,null,null,"Estimated running",null,{"$f":"P131","v":"Estimated running"},null,null,null,"F° env./tool",null,null,null,null,null,{"$f":"P131","v":"Estimated running"},null,null,null,null,1]
[null,null,null,null,null,null,"strokelength",null,null,"temperature","temperature","temperature","Fjäderfaktor","Tryckfaktor","Slagfaktor","temperature between:",null,{"$f":"P132","v":"temperature between:"},null,null,null,"temp.",null,null,null,null,null,{"$f":"P132","v":"temperature between:"},null,null,null,null,1]
[null,null,null,"Spring Size",null,null,"[mm]","[Bar]","[spm]","[°C]","[°F]","[°C]","K1","Kp","Ks","[°C]","[°C]",{"$f":"P133","v":"[°C]"},{"$f":"Q133","v":"[°C]"},"P som [°F]","Q som [°F]","to C°","N + T","U + 10°C","U to F°","V to F°","[°F]","[°F]","[°C]","[°C]",null,null,1]
[{"$f":"CONCATENATE(\"TUR\",\" \",D134)","v":"TUR 10000"},null,null,10000,null,{"$f":"Product_stroke_length_mm","v":7},{"$f":"Used_stroke_for_calculation","v":5},{"$f":"Filling_Pressure_in_bar","v":150},{"$f":"User_SPM","v":20},{"$f":"Surrounding_temperature_in_C°","v":20},77,25,{"$f":"-0.00000004*F134^2+0.000015*F134+0.0145","v":1.4603040000000001E-2},{"$f":"0.9*(H134/150)+0.1","v":1},{"$f":"0.82*(G134/F134)^2+0.075*(G134/F134)+0.1","v":0.571938775510204},{"$f":"F134*I134*M134*N134*O134+J134","v":21.169286274285714},{"$f":"P134+10","v":31.169286274285714},{"$f":"P134","v":21.169286274285714},{"$f":"Q134","v":31.169286274285714},70.104715293714293,88.104715293714293,25,46.16928627428571,56.16928627428571,115.10471529371428,133.10471529371426,115.10471529371428,133.10471529371426,46.16928627428571,56.169286274285703,{"$f":"IF(Q134>80,\"High temp. Please contact your distributor for advice\",IF(H134>150,\"Too high charging pressure!\",\"\"))","v":""},{"$f":"AE134","v":""},1,"Samma värden som TU",null,null,null,null,null,38,48]
[]
[]
[null,null,"Finns ej ","TUS",null,"Strokelength","Utilized","Fill pressure","Frequency","Env./Tool","Env./Tool","Env./Tool",null,null,null,"Estimated running",null,{"$f":"P137","v":"Estimated running"},null,null,null,"F° env./tool",null,null,null,null,null,{"$f":"P137","v":"Estimated running"},null,null,null,null,1]
[null,null,null,null,null,null,"strokelength",null,null,"temperature","temperature","temperature","Fjäderfaktor","Tryckfaktor","Slagfaktor","temperature between:",null,"temperature between:",null,null,null,"temp.",null,null,null,null,null,{"$f":"P138","v":"temperature between:"},null,null,null,null,1]
[null,null,null,"Spring Size",null,null,"[mm]","[Bar]","[spm]","[°C]","[°F]","[°C]","K1","Kp","Ks","[°C]","[°C]","[°C]","[°C]","P som [°F]","Q som [°F]","to C°","N + T","U + 10°C","U to F°","V to F°","[°F]","[°F]","[°C]","[°C]",null,null,1]
[{"$f":"CONCATENATE(\"TUS\",\" \",D140)","v":"TUS 750"},null,null,750,null,{"$f":"Product_stroke_length_mm","v":7},{"$f":"Used_stroke_for_calculation","v":5},{"$f":"Filling_Pressure_in_bar","v":150},{"$f":"User_SPM","v":20},{"$f":"Surrounding_temperature_in_C°","v":20},77,{"$f":"5/9*(K140-32)","v":25},{"$f":"-0.0000002*F140^2+0.00005*F140+0.0132","v":1.35402E-2},{"$f":"0.88*(H140/150)+0.12","v":1},{"$f":"0.3551*(G140/F140)^2+0.5449*(G140/F140)+0.1","v":0.67038775510204085},{"$f":"F140*I140*M140*N140*O140+J140-2","v":19.270805799428572},{"$f":"P140+10","v":29.270805799428572},19.270805799428572,29.270805799428572,{"$f":"9/5*R140+32","v":66.687450438971439},84.687450438971439,25,44.270805799428572,{"$f":"W140+10","v":54.270805799428572},111.68745043897144,129.68745043897144,{"$f":"Y140","v":111.68745043897144},129.68745043897144,{"$f":"5/9*(AA140-32)","v":44.27080579942858},54.27080579942858,{"$f":"IF(Q140>80,\"High temp. Please contact your distributor for advice\",IF(H140>150,\"Too high charging pressure!\",\"\"))","v":""},{"$f":"AE140","v":""},1,"Samma värden som TU",null,null,null,null,null,37,47]
[{"$f":"CONCATENATE(\"TUS\",\" \",D141)","v":"TUS 1500"},null,null,1500,null,{"$f":"Product_stroke_length_mm","v":7},{"$f":"Used_stroke_for_calculation","v":5},{"$f":"Filling_Pressure_in_bar","v":150},{"$f":"User_SPM","v":20},{"$f":"Surrounding_temperature_in_C°","v":20},77,25,{"$f":"-0.00000015*F141^2+0.000027*F141+0.0145","v":1.4681650000000001E-2},{"$f":"0.88*(H141/150)+0.12","v":1},{"$f":"0.82*(G141/F141)^2+0.075*(G141/F141)+0.1","v":0.571938775510204},{"$f":"F141*I141*M141*N141*O141+J141","v":21.175580689285713},{"$f":"P141+10","v":31.175580689285713},21.175580689285713,31.175580689285713,70.116045240714286,88.116045240714286,25,46.175580689285709,56.175580689285709,115.11604524071429,133.1160452407143,115.11604524071429,133.1160452407143,46.175580689285717,56.175580689285724,{"$f":"IF(Q141>80,\"High temp. Please contact your distributor for advice\",IF(H141>150,\"Too high charging pressure!\",\"\"))","v":""},"",1,"Samma värden som TU",null,null,null,null,null,38,48]
["TUS 3000",null,null,3000,null,{"$f":"Product_stroke_length_mm","v":7},{"$f":"Used_stroke_for_calculation","v":5},{"$f":"Filling_Pressure_in_bar","v":150},{"$f":"User_SPM","v":20},{"$f":"Surrounding_temperature_in_C°","v":20},77,25,{"$f":"0.00000005*F142^2-0.000034*F142+0.0186","v":1.8364449999999997E-2},{"$f":"0.75*(H142/150)+0.25","v":1},{"$f":"0.82*(G142/F142)^2+0.075*(G142/F142)+0.1","v":0.571938775510204},{"$f":"F142*I142*M142*N142*O142+J142","v":21.470467746428572},{"$f":"P142+10","v":31.470467746428572},21.470467746428572,31.470467746428572,70.646841943571431,88.646841943571431,25,46.470467746428568,56.470467746428568,115.64684194357143,133.64684194357142,115.64684194357143,133.64684194357142,46.470467746428575,56.470467746428568,{"$f":"IF(Q142>80,\"High temp. Please contact your distributor for advice\",IF(H142>150,\"Too high charging pressure!\",\"\"))","v":""},"",1,"Samma värden som TU",null,null,null,null,null,38,48]
["TUS 5000",null,null,5000,null,{"$f":"Product_stroke_length_mm","v":7},{"$f":"Used_stroke_for_calculation","v":5},{"$f":"Filling_Pressure_in_bar","v":150},{"$f":"User_SPM","v":20},{"$f":"Surrounding_temperature_in_C°","v":20},77,25,{"$f":"-0.000003*F143+0.0155","v":1.5479E-2},{"$f":"0.89*(H143/150)+0.11","v":1},{"$f":"0.82*(G143/F143)^2+0.075*(G143/F143)+0.1","v":0.571938775510204},{"$f":"F143*I143*M143*N143*O143+J143","v":21.239425642857142},{"$f":"P143+10","v":31.239425642857142},21.239425642857142,31.239425642857142,70.230966157142859,88.230966157142859,25,46.239425642857142,56.239425642857142,115.23096615714286,133.23096615714286,115.23096615714286,133.23096615714286,46.23942564285715,56.23942564285715,{"$f":"IF(Q143>80,\"High temp. Please contact your distributor for advice\",IF(H143>150,\"Too high charging pressure!\",\"\"))","v":""},"",1,"Samma värden som TU",null,null,null,null,null,38,48]
["TUS 7500",null,null,7500,null,{"$f":"Product_stroke_length_mm","v":7},{"$f":"Used_stroke_for_calculation","v":5},{"$f":"Filling_Pressure_in_bar","v":150},{"$f":"User_SPM","v":20},{"$f":"Surrounding_temperature_in_C°","v":20},77,25,{"$f":"-0.000018*F144+0.025","v":2.4874E-2},{"$f":"0.85*(H144/150)+0.15","v":1},{"$f":"0.82*(G144/F144)^2+0.075*(G144/F144)+0.1","v":0.571938775510204},{"$f":"F144*I144*M144*N144*O144+J144","v":21.991696714285712},{"$f":"P144+10","v":31.991696714285712},21.991696714285712,31.991696714285712,71.58505408571429,89.58505408571429,25,46.991696714285709,56.991696714285709,116.58505408571428,134.58505408571426,116.58505408571428,134.58505408571426,46.991696714285709,56.991696714285702,{"$f":"IF(Q144>80,\"High temp. Please contact your distributor for advice\",IF(H144>150,\"Too high charging pressure!\",\"\"))","v":""},"",1,"Samma värden som TU",null,null,null,null,null,44,54]
[]
[]
[null,null,"T4-","TX",null,"Strokelength","Utilized","Fill pressure","Frequency","Env./Tool","Env./Tool","Env./Tool",null,"Tryckfaktor Kp",null,"Estimated running",null,{"$f":"P147","v":"Estimated running"},null,null,null,"F° env./tool",null,null,null,null,null,{"$f":"P147","v":"Estimated running"},null,null,null,null,1]
[null,null,null,null,null,null,"strokelength",null,null,"temperature","temperature","temperature","Fjäderfaktor K1","Tryck-och","Slagfaktor Ks","temperature between:",null,{"$f":"P148","v":"temperature between:"},null,null,null,"temp.",null,null,null,null,null,{"$f":"P148","v":"temperature between:"},null,null,null,null,1]
[null,null,"Spring Size","Spring Size",null,null,"[mm]","[Bar]","[spm]","[°C]","[°F]","[°C]","Slaglängdsfaktor","SPM-faktor","%-faktor","[°C]","[°C]",{"$f":"P149","v":"[°C]"},{"$f":"Q149","v":"[°C]"},"P som [°F]","Q som [°F]","to C°","N + T","U + 10°C","U to F°","V to F°","[°F]","[°F]","[°C]","[°C]",null,null,1]
[{"$f":"CONCATENATE(\"TX\",\" \",D150)","v":"TX 750"},null,750,750,null,{"$f":"Product_stroke_length_mm","v":7},{"$f":"Used_stroke_for_calculation","v":5},{"$f":"Filling_Pressure_in_bar","v":150},{"$f":"User_SPM","v":20},{"$f":"Surrounding_temperature_in_C°","v":20},77,25,{"$f":"-0.00000013726*F150^2-0.0000076261*F150+0.0133","v":1.323989156E-2},{"$f":"0.1645*EXP(1.7*(H150/150))+0.1","v":1.0004643459391245},{"$f":"0.496*(G150/F150)^2+0.4572*(G150/F150)+0.05","v":0.62963265306122451},{"$f":"((F150*I150*M150*N150*O150)*0.9)+J150","v":21.050857509134108},{"$f":"P150+10","v":31.050857509134108},{"$f":"P150","v":21.050857509134108},{"$f":"Q150","v":31.050857509134108},69.891543516441402,87.891543516441402,{"$f":"5/9*(K150-32)","v":25},{"$f":"P150+V150","v":46.050857509134104},56.050857509134104,{"$f":"9/5*W150+32","v":114.89154351644139},132.8915435164414,114.89154351644139,132.8915435164414,46.050857509134104,56.050857509134111,{"$f":"IF(Q150>80,\"High temp. Please contact your distributor for advice\",IF(H150>150,\"Too high charging pressure!\",\"\"))","v":""},"",2,"Nya tester alt. samma som TU 500",null,null,null,null,null,31,41]
[{"$f":"CONCATENATE(\"TX\",\" \",D151)","v":"TX 1000"},null,1000,1000,null,7,5,150,20,20,77,25,{"$f":"-0.0000002*F151^2+0.00005*F151+0.0132","v":1.35402E-2},{"$f":"0.88*(H151/150)+0.12","v":1},{"$f":"0.3551*(G151/F151)^2+0.5449*(G151/F151)+0.1","v":0.67038775510204085},{"$f":"F151*I151*M151*N151*O151+J151-2","v":19.270805799428572},29.270805799428572,{"$f":"P151","v":19.270805799428572},29.270805799428572,66.687450438971439,84.687450438971439,25,44.270805799428572,54.270805799428572,111.68745043897144,129.68745043897144,111.68745043897144,129.68745043897144,44.27080579942858,54.27080579942858,"","",1,"Samma värden som TU 750",null,null,null,null,null,39,49]
["TX 1500",null,1500,1500,null,7,5,150,20,20,77,25,{"$f":"0.123963746670613*F152","v":0.86774622669429102},{"$f":"(0.0703967741935484*H152+5.52354838709677)*(0.000530647743213614*I152^2+0.274166602843941*I152)","v":91.602559989917694},{"$f":"(100*G152/F152)*0.171918187168923","v":12.279870512065928},{"$f":"J152+(M152*N152*O152*0.000731558156516041+4.52833074925737)","v":25.242404368786335},35.242404368786339,25.242404368786335,35.242404368786339,77.436327863815407,95.436327863815421,25,50.242404368786339,60.242404368786339,122.43632786381541,140.43632786381539,122.43632786381541,140.43632786381539,50.242404368786339,60.242404368786332,"","",2,"Nya tester",null,null,null,null,null,37,47]
["TX 2400",null,2400,2400,null,7,5,150,20,20,77,25,{"$f":"-0.00000015*F153^2+0.000027*F153+0.0145","v":1.4681650000000001E-2},{"$f":"0.88*(H153/150)+0.12","v":1},{"$f":"0.82*(G153/F153)^2+0.075*(G153/F153)+0.1","v":0.571938775510204},{"$f":"F153*I153*M153*N153*O153+J153","v":21.175580689285713},31.175580689285713,21.175580689285713,31.175580689285713,70.116045240714286,88.116045240714286,25,46.175580689285709,56.175580689285709,115.11604524071429,133.1160452407143,115.11604524071429,133.1160452407143,46.175580689285717,56.175580689285724,"","",1,"Samma värden som TU 1500",null,null,null,null,null,41,51]
["TX 4200",null,4200,4200,null,7,5,150,20,20,77,25,{"$f":"0.00000005*F154^2-0.000034*F154+0.0186","v":1.8364449999999997E-2},{"$f":"0.75*(H154/150)+0.25","v":1},{"$f":"0.82*(G154/F154)^2+0.075*(G154/F154)+0.1","v":0.571938775510204},{"$f":"F154*I154*M154*N154*O154+J154","v":21.470467746428572},31.470467746428572,21.470467746428572,31.470467746428572,70.646841943571431,88.646841943571431,25,46.470467746428568,56.470467746428568,115.64684194357143,133.64684194357142,115.64684194357143,133.64684194357142,46.470467746428575,56.470467746428568,"","",1,"Samma värden som TU 3000",null,null,null,null,null,41,51]
["TX 6600",null,6600,6600,null,7,5,150,20,20,77,25,{"$f":"-0.000003*F155+0.0155","v":1.5479E-2},{"$f":"0.89*(H155/150)+0.11","v":1},{"$f":"0.82*(G155/F155)^2+0.075*(G155/F155)+0.1","v":0.571938775510204},{"$f":"F155*I155*M155*N155*O155+J155","v":21.239425642857142},31.239425642857142,21.239425642857142,31.239425642857142,70.230966157142859,88.230966157142859,25,46.239425642857142,56.239425642857142,115.23096615714286,133.23096615714286,115.23096615714286,133.23096615714286,46.23942564285715,56.23942564285715,"","",1,"Samma värden som TU 5000",null,null,null,null,null,40,50]
["TX 9500",null,9500,9500,null,7,5,150,20,20,77,25,{"$f":"-0.000018*F156+0.025","v":2.4874E-2},{"$f":"0.85*(H156/150)+0.15","v":1},{"$f":"0.82*(G156/F156)^2+0.075*(G156/F156)+0.1","v":0.571938775510204},{"$f":"F156*I156*M156*N156*O156+J156","v":21.991696714285712},31.991696714285712,21.991696714285712,31.991696714285712,71.58505408571429,89.58505408571429,25,46.991696714285709,56.991696714285709,116.58505408571428,134.58505408571426,116.58505408571428,134.58505408571426,46.991696714285709,56.991696714285702,"","",1,"Samma värden som TU 7500",null,null,null,null,null,48,58]
["TX 20000",null,20000,20000,null,7,5,150,20,20,77,25,{"$f":"-0.00000004*F157^2+0.000015*F157+0.0145","v":1.4603040000000001E-2},{"$f":"0.9*(H157/150)+0.1","v":1},{"$f":"0.82*(G157/F157)^2+0.075*(G157/F157)+0.1","v":0.571938775510204},{"$f":"F157*I157*M157*N157*O157+J157","v":21.169286274285714},31.169286274285714,21.169286274285714,31.169286274285714,70.104715293714293,88.104715293714293,25,46.16928627428571,56.16928627428571,115.10471529371428,133.10471529371426,115.10471529371428,133.10471529371426,46.16928627428571,56.169286274285703,"","",2,"Nya tester alt. samma som TU 10T",null,null,null,null,null,41,51]
[]
[]
[]
[null,null,null,"Kopia av X-data",null,"Strokelength","Utilized","Fill pressure","Frequency","Env./Tool","Env./Tool","Env./Tool",null,null,null,"Estimated running",null,{"$f":"P161","v":"Estimated running"},null,null,null,"F° env./tool",null,null,null,null,null,{"$f":"P161","v":"Estimated running"},null,null,null,null,1]
[null,null,null,"2017-05-29",null,null,"strokelength",null,null,"temperature","temperature","temperature","Fjäderfaktor","Tryckfaktor","Slagfaktor","temperature between:",null,"temperature between:",null,null,null,"temp.",null,null,null,null,null,{"$f":"P162","v":"temperature between:"},null,null,null,null,1]
[null,null,"Spring Size","Spring Size",null,null,"[mm]","[Bar]","[spm]","[°C]","[°F]","[°C]","K1","Kp","Ks","[°C]","[°C]","[°C]",{"$f":"Q163","v":"[°C]"},"P som [°F]","Q som [°F]","to C°","N + T","U + 10°C","U to F°","V to F°","[°F]","[°F]","[°C]","[°C]",null,null,1]
[{"$f":"CONCATENATE(\"XF\",\" \",D164)","v":"XF 750"},null,750,750,null,{"$f":"Product_stroke_length_mm","v":7},{"$f":"Used_stroke_for_calculation","v":5},{"$f":"Filling_Pressure_in_bar","v":150},{"$f":"User_SPM","v":20},{"$f":"Surrounding_temperature_in_C°","v":20},77,{"$f":"5/9*(K164-32)","v":25},{"$f":"-5.21759415768633E-06*F164+0.011064444","v":1.1027920840896195E-2},{"$f":"0.7*(H164/150)+0.3","v":1},{"$f":"(G164/F164)^1.15","v":0.67912975524721897},{"$f":"F164*I164*M164*N164*O164+J164","v":21.048514485418895},{"$f":"P164+10","v":31.048514485418895},21.048514485418895,31.048514485418895,{"$f":"9/5*R164+32","v":69.887326073754011},{"$f":"9/5*S164+32","v":87.887326073754011},{"$f":"5/9*(K164-32)","v":25},{"$f":"P164+V164","v":46.048514485418892},{"$f":"W164+10","v":56.048514485418892},{"$f":"9/5*W164+32","v":114.88732607375401},{"$f":"9/5*X164+32","v":132.88732607375402},{"$f":"Y164","v":114.88732607375401},{"$f":"Z164","v":132.88732607375402},{"$f":"5/9*(AA164-32)","v":46.048514485418899},{"$f":"5/9*(AB164-32)","v":56.048514485418906},{"$f":"IF(Q164>80,\"High temp. Please contact your distributor for advice\",IF(H164>150,\"Too high charging pressure!\",\"\"))","v":""},{"$f":"AE164","v":""},1,"Samma värden som idag",null,null,null,null,null,34,44]
["XF 1000",null,1000,1000,null,{"$f":"Product_stroke_length_mm","v":7},{"$f":"Used_stroke_for_calculation","v":5},{"$f":"Filling_Pressure_in_bar","v":150},{"$f":"User_SPM","v":20},{"$f":"Surrounding_temperature_in_C°","v":20},77,25,{"$f":"-3.37582158982632E-06*F165+0.012213964","v":1.2190333248871216E-2},{"$f":"0.79*(H165/150)+0.21","v":1},0.67912975524721897,21.159034524996311,31.159034524996311,21.159034524996311,31.159034524996311,70.086262144993356,88.086262144993356,25,46.159034524996315,56.159034524996315,115.08626214499337,133.08626214499338,115.08626214499337,133.08626214499338,46.159034524996322,56.159034524996329,"","",1,"Samma värden som idag",null,null,null,null,null,36,46]
["XF 1500",null,1500,1500,null,{"$f":"Product_stroke_length_mm","v":7},{"$f":"Used_stroke_for_calculation","v":5},{"$f":"Filling_Pressure_in_bar","v":150},{"$f":"User_SPM","v":20},{"$f":"Surrounding_temperature_in_C°","v":20},77,25,{"$f":"-0.0000115814333465656*F166+0.0161709","v":1.6089829966574039E-2},{"$f":"0.84*(H166/150)+0.16","v":1},0.67912975524721897,21.529791520203631,31.529791520203631,21.529791520203631,31.529791520203631,70.753624736366532,88.753624736366532,25,46.529791520203631,56.529791520203631,115.75362473636653,133.75362473636653,115.75362473636653,133.75362473636653,46.529791520203631,56.529791520203631,"","",1,"Samma värden som idag",null,null,null,null,null,38,48]
["XF 2400",null,2400,2400,null,{"$f":"Product_stroke_length_mm","v":7},{"$f":"Used_stroke_for_calculation","v":5},{"$f":"Filling_Pressure_in_bar","v":150},{"$f":"User_SPM","v":20},{"$f":"Surrounding_temperature_in_C°","v":20},77,25,1.5820000000000001E-2,{"$f":"0.87*(H167/150)+0.13","v":1},0.67912975524721897,21.504136581921539,31.504136581921539,21.504136581921539,31.504136581921539,70.707445847458771,88.707445847458771,25,46.504136581921543,56.504136581921543,115.70744584745879,133.70744584745879,115.70744584745879,133.70744584745879,46.50413658192155,56.50413658192155,"","",1,"Samma värden som idag",null,null,null,null,null,39,49]

{"sheet":"KallerTemp","index":9,"n_rows":863,"n_cols":14,"rows_kept":863,"cut":false,"hidden":true,"merged":[]}
["Detta är värden ur katalog/MC",null,null,"Serie","Modell","Slagl","Fi","Fs","Tryck","StrCode"]
[null,null,null,"TU",250,10,2650,3500,150,"TU 250-10"]
[null,null,null,"TU",250,12.7,2650,3500,150,"TU 250-12,7"]
[null,null,null,"TU",250,16,2650,3500,150,"TU 250-16",null,null,"Not:"]
[null,null,null,"TU",250,25,2650,3500,150,"TU 250-25",null,null,"2017-01-11","CU4, CX, K, LCF, XG, R12, R15, TL, TUS, TUR inlagda"]
[null,null,null,"TU",250,38.1,2650,3500,150,"TU 250-38,1"]
[null,null,null,"TU",250,50,2650,3500,150,"TU 250-50"]
[null,null,null,"TU",250,63.5,2650,3500,150,"TU 250-63,5"]
[null,null,null,"TU",250,80,2650,3500,150,"TU 250-80"]
[null,null,null,"TU",250,100,2650,3500,150,"TU 250-100"]
[null,null,null,"TU",250,125,2650,3500,150,"TU 250-125"]
[null,null,null,"TU",500,10,4700,6000,150,"TU 500-10"]
[null,null,null,"TU",500,12.7,4700,6100,150,"TU 500-12,7"]
[null,null,null,"TU",500,25,4700,6400,150,"TU 500-25"]
[null,null,null,"TU",500,38.1,4700,6500,150,"TU 500-38,1"]
[null,null,null,"TU",500,50,4700,6600,150,"TU 500-50"]
[null,null,null,"TU",500,63.5,4700,6600,150,"TU 500-63,5"]
[null,null,null,"TU",500,80,4700,6700,150,"TU 500-80"]
[null,null,null,"TU",500,100,4700,6700,150,"TU 500-100"]
[null,null,null,"TU",500,125,4700,6700,150,"TU 500-125"]
[null,null,null,"TU",500,160,4700,6700,150,"TU 500-160"]
[null,null,null,"TU",750,12.7,7400,12000,150,"TU 750-12,7"]
[null,null,null,"TU",750,25,7400,12000,150,"TU 750-25"]
[null,null,null,"TU",750,38.1,7400,12000,150,"TU 750-38,1"]
[null,null,null,"TU",750,50,7400,12000,150,"TU 750-50"]
[null,null,null,"TU",750,63.5,7400,12000,150,"TU 750-63,5"]
[null,null,null,"TU",750,80,7400,12000,150,"TU 750-80"]
[null,null,null,"TU",750,100,7400,12000,150,"TU 750-100"]
[null,null,null,"TU",750,125,7400,12100,150,"TU 750-125"]
[null,null,null,"TU",750,160,7400,12100,150,"TU 750-160"]
[null,null,null,"TU",750,200,7400,12100,150,"TU 750-200"]
[null,null,null,"TU",750,250,7400,12100,150,"TU 750-250"]
[null,null,null,"TU",750,300,7400,12100,150,"TU 750-300"]
[null,null,null,"TU",1500,25,15000,23000,150,"TU 1500-25"]
[null,null,null,"TU",1500,38.1,15000,23000,150,"TU 1500-38,1"]
[null,null,null,"TU",1500,50,15000,23000,150,"TU 1500-50"]
[null,null,null,"TU",1500,63.5,15000,23000,150,"TU 1500-63,5"]
[null,null,null,"TU",1500,80,15000,23000,150,"TU 1500-80"]
[null,null,null,"TU",1500,100,15000,23000,150,"TU 1500-100"]
[null,null,null,"TU",1500,125,15000,23000,150,"TU 1500-125"]
[null,null,null,"TU",1500,160,15000,23000,150,"TU 1500-160"]
[null,null,null,"TU",1500,200,15000,23000,150,"TU 1500-200"]
[null,null,null,"TU",1500,250,15000,23000,150,"TU 1500-250"]
[null,null,null,"TU",1500,300,15000,23000,150,"TU 1500-300"]
[null,null,null,"TU",3000,25,30000,42000,150,"TU 3000-25"]
[null,null,null,"TU",3000,38.1,30000,43000,150,"TU 3000-38,1"]
[null,null,null,"TU",3000,50,30000,44000,150,"TU 3000-50"]
[null,null,null,"TU",3000,63.5,30000,45000,150,"TU 3000-63,5"]
[null,null,null,"TU",3000,80,30000,46000,150,"TU 3000-80"]
[null,null,null,"TU",3000,100,30000,47000,150,"TU 3000-100"]
[null,null,null,"TU",3000,125,30000,47000,150,"TU 3000-125"]
[null,null,null,"TU",3000,160,30000,47000,150,"TU 3000-160"]
[null,null,null,"TU",3000,200,30000,48000,150,"TU 3000-200"]
[null,null,null,"TU",3000,250,30000,48000,150,"TU 3000-250"]
[null,null,null,"TU",3000,300,30000,48000,150,"TU 3000-300"]
[null,null,null,"TU",5000,25,50000,71000,150,"TU 5000-25"]
[null,null,null,"TU",5000,38.1,50000,75000,150,"TU 5000-38,1"]
[null,null,null,"TU",5000,50,50000,77000,150,"TU 5000-50"]
[null,null,null,"TU",5000,63.5,50000,80000,150,"TU 5000-63,5"]
[null,null,null,"TU",5000,80,50000,81000,150,"TU 5000-80"]
[null,null,null,"TU",5000,100,50000,82000,150,"TU 5000-100"]
[null,null,null,"TU",5000,125,50000,82000,150,"TU 5000-125"]
[null,null,null,"TU",5000,160,50000,83000,150,"TU 5000-160"]
[null,null,null,"TU",5000,200,50000,84000,150,"TU 5000-200"]
[null,null,null,"TU",5000,250,50000,84000,150,"TU 5000-250"]
[null,null,null,"TU",5000,300,50000,84000,150,"TU 5000-300"]
[null,null,null,"TU",7500,25,75000,105000,150,"TU 7500-25"]
[null,null,null,"TU",7500,38.1,75000,110000,150,"TU 7500-38,1"]
[null,null,null,"TU",7500,50,75000,113000,150,"TU 7500-50"]
[null,null,null,"TU",7500,63.5,75000,115000,150,"TU 7500-63,5"]
[null,null,null,"TU",7500,80,75000,117000,150,"TU 7500-80"]
[null,null,null,"TU",7500,100,75000,119000,150,"TU 7500-100"]
[null,null,null,"TU",7500,125,75000,121000,150,"TU 7500-125"]
[null,null,null,"TU",7500,160,75000,122000,150,"TU 7500-160"]
[null,null,null,"TU",7500,200,75000,123000,150,"TU 7500-200"]
[null,null,null,"TU",7500,250,75000,124000,150,"TU 7500-250"]
[null,null,null,"TU",7500,300,75000,124000,150,"TU 7500-300"]
[null,null,null,"TU",10000,25,106000,138000,150,"TU 10000-25"]
[null,null,null,"TU",10000,38.1,106000,143000,150,"TU 10000-38,1"]
[null,null,null,"TU",10000,50,106000,147000,150,"TU 10000-50"]
[null,null,null,"TU",10000,63.5,106000,150000,150,"TU 10000-63,5"]
[null,null,null,"TU",10000,80,106000,152000,150,"TU 10000-80"]
[null,null,null,"TU",10000,100,106000,156000,150,"TU 10000-100"]
[null,null,null,"TU",10000,125,106000,157000,150,"TU 10000-125"]
[null,null,null,"TU",10000,160,106000,158000,150,"TU 10000-160"]
[null,null,null,"TU",10000,200,106000,160000,150,"TU 10000-200"]
[null,null,null,"TU",10000,250,106000,160000,150,"TU 10000-250"]
[null,null,null,"TU",10000,300,106000,160000,150,"TU 10000-300"]
[null,null,null,"X",170,7,1700,2800,180,"X 170-7"]
[null,null,null,"X",170,10,1700,2800,180,"X 170-10"]
[null,null,null,"X",170,15,1700,2800,180,"X 170-15"]
[null,null,null,"X",170,19,1700,2800,180,"X 170-19"]
[null,null,null,"X",170,25,1700,2800,180,"X 170-25"]
[null,null,null,"X",170,38,1700,2800,180,"X 170-38"]
[null,null,null,"X",170,50,1700,2800,180,"X 170-50"]
[null,null,null,"X",170,63,1700,2800,180,"X 170-63"]
[null,null,null,"X",170,75,1700,2800,180,"X 170-75"]
[null,null,null,"X",170,80,1700,2800,180,"X 170-80"]
[null,null,null,"X",170,100,1700,2800,180,"X 170-100"]
[null,null,null,"X",170,125,1700,2800,180,"X 170-125"]
[null,null,null,"X",320,7,3200,4800,180,"X 320-7"]
[null,null,null,"X",320,10,3200,4900,180,"X 320-10"]
[null,null,null,"X",320,15,3200,5100,180,"X 320-15"]
[null,null,null,"X",320,19,3200,5100,180,"X 320-19"]
[null,null,null,"X",320,25,3200,5200,180,"X 320-25"]
[null,null,null,"X",320,38,3200,5300,180,"X 320-38"]
[null,null,null,"X",320,50,3200,5300,180,"X 320-50"]
[null,null,null,"X",320,63,3200,5300,180,"X 320-63"]
[null,null,null,"X",320,75,3200,5300,180,"X 320-75"]
[null,null,null,"X",320,80,3200,5300,180,"X 320-80"]
[null,null,null,"X",320,100,3200,5300,180,"X 320-100"]
[null,null,null,"X",320,125,3200,5300,180,"X 320-125"]
[null,null,null,"X",350,10,3600,5900,180,"X 350-10"]
[null,null,null,"X",350,13,3600,5200,180,"X 350-13"]
[null,null,null,"X",350,16,3600,5300,180,"X 350-16"]
[null,null,null,"X",350,19,3600,5600,180,"X 350-19"]
[null,null,null,"X",350,25,3600,5500,180,"X 350-25"]
[null,null,null,"X",350,32,3600,5500,180,"X 350-32"]
[null,null,null,"X",350,38,3600,5500,180,"X 350-38"]
[null,null,null,"X",350,50,3600,5600,180,"X 350-50"]
[null,null,null,"X",350,63,3600,5500,180,"X 350-63"]
[null,null,null,"X",350,75,3600,5500,180,"X 350-75"]
[null,null,null,"X",350,80,3600,5500,180,"X 350-80"]
[null,null,null,"X",350,100,3600,5500,180,"X 350-100"]
[null,null,null,"X",350,125,3600,5500,180,"X 350-125"]
[null,null,null,"X",500,10,4700,7200,150,"X 500-10"]
[null,null,null,"X",500,13,4700,7100,150,"X 500-13"]
[null,null,null,"X",500,16,4700,7200,150,"X 500-16"]
[null,null,null,"X",500,19,4700,7400,150,"X 500-19"]
[null,null,null,"X",500,25,4700,7300,150,"X 500-25"]
[null,null,null,"X",500,32,4700,7200,150,"X 500-32"]
[null,null,null,"X",500,38,4700,7200,150,"X 500-38"]
[null,null,null,"X",500,50,4700,7200,150,"X 500-50"]
[null,null,null,"X",500,63,4700,7200,150,"X 500-63"]
[null,null,null,"X",500,75,4700,7100,150,"X 500-75"]
[null,null,null,"X",500,80,4700,7100,150,"X 500-80"]
[null,null,null,"X",500,100,4700,7100,150,"X 500-100"]
[null,null,null,"X",500,125,4700,7100,150,"X 500-125"]
[null,null,null,"X",750,10,7400,12100,150,"X 750-10"]
[null,null,null,"X",750,13,7400,12100,150,"X 750-13"]
[null,null,null,"X",750,16,7400,12100,150,"X 750-16"]
[null,null,null,"X",750,19,7400,11700,150,"X 750-19"]
[null,null,null,"X",750,25,7400,11800,150,"X 750-25"]
[null,null,null,"X",750,32,7400,11800,150,"X 750-32"]
[null,null,null,"X",750,38,7400,11800,150,"X 750-38"]
[null,null,null,"X",750,50,7400,11800,150,"X 750-50"]
[null,null,null,"X",750,63,7400,11800,150,"X 750-63"]
[null,null,null,"X",750,75,7400,11900,150,"X 750-75"]
[null,null,null,"X",750,80,7400,11900,150,"X 750-80"]
[null,null,null,"X",750,100,7400,11900,150,"X 750-100"]
[null,null,null,"X",750,125,7400,11900,150,"X 750-125"]
[null,null,null,"X",1000,13,9200,13800,150,"X 1000-13"]
[null,null,null,"X",1000,16,9200,13800,150,"X 1000-16"]
[null,null,null,"X",1000,19,9200,14000,150,"X 1000-19"]
[null,null,null,"X",1000,25,9200,14200,150,"X 1000-25"]
[null,null,null,"X",1000,32,9200,14300,150,"X 1000-32"]
[null,null,null,"X",1000,38,9200,14500,150,"X 1000-38"]
[null,null,null,"X",1000,50,9200,14600,150,"X 1000-50"]
[null,null,null,"X",1000,63,9200,14700,150,"X 1000-63"]
[null,null,null,"X",1000,75,9200,14700,150,"X 1000-75"]
[null,null,null,"X",1000,80,9200,14800,150,"X 1000-80"]
[null,null,null,"X",1000,100,9200,14800,150,"X 1000-100"]
[null,null,null,"X",1000,125,9200,14800,150,"X 1000-125"]
[null,null,null,"X",1500,13,15000,24000,150,"X 1500-13"]
[null,null,null,"X",1500,16,15000,24100,150,"X 1500-16"]
[null,null,null,"X",1500,19,15000,24200,150,"X 1500-19"]
[null,null,null,"X",1500,25,15000,24300,150,"X 1500-25"]
[null,null,null,"X",1500,32,15000,23800,150,"X 1500-32"]
[null,null,null,"X",1500,38,15000,23900,150,"X 1500-38"]
[null,null,null,"X",1500,50,15000,24000,150,"X 1500-50"]
[null,null,null,"X",1500,63,15000,24100,150,"X 1500-63"]
[null,null,null,"X",1500,75,15000,24200,150,"X 1500-75"]
[null,null,null,"X",1500,80,15000,24200,150,"X 1500-80"]
[null,null,null,"X",1500,100,15000,24300,150,"X 1500-100"]
[null,null,null,"X",1500,125,15000,24300,150,"X 1500-125"]
[null,null,null,"X",2400,16,24000,38300,150,"X 2400-16"]
[null,null,null,"X",2400,19,24000,38500,150,"X 2400-19"]
[null,null,null,"X",2400,25,24000,38700,150,"X 2400-25"]
[null,null,null,"X",2400,32,24000,38600,150,"X 2400-32"]
[null,null,null,"X",2400,38,24000,38400,150,"X 2400-38"]
[null,null,null,"X",2400,50,24000,39200,150,"X 2400-50"]
[null,null,null,"X",2400,63,24000,39200,150,"X 2400-63"]
[null,null,null,"X",2400,75,24000,39200,150,"X 2400-75"]
[null,null,null,"X",2400,80,24000,39200,150,"X 2400-80"]
[null,null,null,"X",2400,100,24000,39300,150,"X 2400-100"]
[null,null,null,"X",2400,125,24000,39300,150,"X 2400-125"]
[null,null,null,"X",4200,16,42000,61700,150,"X 4200-16"]
[null,null,null,"X",4200,19,42000,63700,150,"X 4200-19"]
[null,null,null,"X",4200,25,42000,60800,150,"X 4200-25"]
[null,null,null,"X",4200,32,42000,64300,150,"X 4200-32"]
[null,null,null,"X",4200,38,42000,65800,150,"X 4200-38"]
[null,null,null,"X",4200,50,42000,67000,150,"X 4200-50"]
[null,null,null,"X",4200,63,42000,67800,150,"X 4200-63"]
[null,null,null,"X",4200,75,42000,68000,150,"X 4200-75"]
[null,null,null,"X",4200,80,42000,68600,150,"X 4200-80"]
[null,null,null,"X",4200,100,42000,69100,150,"X 4200-100"]
[null,null,null,"X",4200,125,42000,69600,150,"X 4200-125"]
[null,null,null,"X",6600,16,66300,89000,150,"X 6600-16"]
[null,null,null,"X",6600,19,66300,91000,150,"X 6600-19"]
[null,null,null,"X",6600,25,66300,93900,150,"X 6600-25"]
[null,null,null,"X",6600,32,66300,96100,150,"X 6600-32"]
[null,null,null,"X",6600,38,66300,98200,150,"X 6600-38"]
[null,null,null,"X",6600,50,66300,100600,150,"X 6600-50"]
[null,null,null,"X",6600,63,66300,102400,150,"X 6600-63"]
[null,null,null,"X",6600,75,66300,103400,150,"X 6600-75"]
[null,null,null,"X",6600,80,66300,104100,150,"X 6600-80"]
[null,null,null,"X",6600,100,66300,105400,150,"X 6600-100"]
[null,null,null,"X",6600,125,66300,106500,150,"X 6600-125"]
[null,null,null,"X",9500,19,95000,135000,150,"X 9500-19"]
[null,null,null,"X",9500,25,95000,139000,150,"X 9500-25"]
[null,null,null,"X",9500,32,95000,142000,150,"X 9500-32"]
[null,null,null,"X",9500,38,95000,143000,150,"X 9500-38"]
[null,null,null,"X",9500,50,95000,146000,150,"X 9500-50"]
[null,null,null,"X",9500,63,95000,148000,150,"X 9500-63"]
[null,null,null,"X",9500,75,95000,149000,150,"X 9500-75"]
[null,null,null,"X",9500,80,95000,150000,150,"X 9500-80"]
[null,null,null,"X",9500,100,95000,151000,150,"X 9500-100"]
[null,null,null,"X",9500,125,95000,152000,150,"X 9500-125"]
[null,null,null,"X",20000,19,200000,259000,150,"X 20000-19"]
[null,null,null,"X",20000,25,200000,270000,150,"X 20000-25"]
[null,null,null,"X",20000,32,200000,280000,150,"X 20000-32"]
[null,null,null,"X",20000,38,200000,287000,150,"X 20000-38"]
[null,null,null,"X",20000,50,200000,298000,150,"X 20000-50"]
[null,null,null,"X",20000,63,200000,307000,150,"X 20000-63"]
[null,null,null,"X",20000,75,200000,313000,150,"X 20000-75"]
[null,null,null,"X",20000,80,200000,315000,150,"X 20000-80"]
[null,null,null,"X",20000,100,200000,323000,150,"X 20000-100"]
[null,null,null,"X",20000,125,200000,330000,150,"X 20000-125"]
[null,null,null,"TX",750,13,7400,12000,150,"TX 750-13"]
[null,null,null,"TX",750,25,7400,12000,150,"TX 750-25"]
[null,null,null,"TX",750,38,7400,12000,150,"TX 750-38"]
[null,null,null,"TX",750,50,7400,12000,150,"TX 750-50"]
[null,null,null,"TX",750,63,7400,12000,150,"TX 750-63"]
[null,null,null,"TX",750,75,7400,12000,150,"TX 750-75"]
[null,null,null,"TX",750,80,7400,12000,150,"TX 750-80"]
[null,null,null,"TX",750,100,7400,12000,150,"TX 750-100"]
[null,null,null,"TX",750,125,7400,12100,150,"TX 750-125"]
[null,null,null,"TX",750,150,7400,12100,150,"TX 750-150"]
[null,null,null,"TX",750,160,7400,12100,150,"TX 750-160"]
[null,null,null,"TX",750,175,7400,12000,150,"TX 750-175"]
[null,null,null,"TX",750,200,7400,12100,150,"TX 750-200"]
[null,null,null,"TX",1000,13,9200,11200,150,"TX 1000-13"]
[null,null,null,"TX",1000,25,9200,12100,150,"TX 1000-25"]
[null,null,null,"TX",1000,38,9200,12800,150,"TX 1000-38"]
[null,null,null,"TX",1000,50,9200,13200,150,"TX 1000-50"]
[null,null,null,"TX",1000,63,9200,13500,150,"TX 1000-63"]
[null,null,null,"TX",1000,75,9200,13700,150,"TX 1000-75"]
[null,null,null,"TX",1000,80,9200,13800,150,"TX 1000-80"]
[null,null,null,"TX",1000,100,9200,14100,150,"TX 1000-100"]
[null,null,null,"TX",1000,125,9200,14300,150,"TX 1000-125"]
[null,null,null,"TX",1000,150,9200,14500,150,"TX 1000-150"]
[null,null,null,"TX",1000,160,9200,14500,150,"TX 1000-160"]
[null,null,null,"TX",1000,175,9200,14600,150,"TX 1000-175"]
[null,null,null,"TX",1000,200,9200,14700,150,"TX 1000-200"]
[null,null,null,"TX",1000,250,9200,14800,150,"TX 1000-250"]
[null,null,null,"TX",1000,300,9200,14900,150,"TX 1000-300"]
[null,null,null,"TX",1500,13,15000,17700,150,"TX 1500-13"]
[null,null,null,"TX",1500,25,15000,19100,150,"TX 1500-25"]
[null,null,null,"TX",1500,38,15000,20000,150,"TX 1500-38"]
[null,null,null,"TX",1500,50,15000,20600,150,"TX 1500-50"]
[null,null,null,"TX",1500,63,15000,21100,150,"TX 1500-63"]
[null,null,null,"TX",1500,75,15000,21500,150,"TX 1500-75"]
[null,null,null,"TX",1500,80,15000,21600,150,"TX 1500-80"]
[null,null,null,"TX",1500,100,15000,21700,150,"TX 1500-100"]
[null,null,null,"TX",1500,125,15000,22400,150,"TX 1500-125"]
[null,null,null,"TX",1500,150,15000,22500,150,"TX 1500-150"]
[null,null,null,"TX",1500,160,15000,22600,150,"TX 1500-160"]
[null,null,null,"TX",1500,175,15000,22600,150,"TX 1500-175"]
[null,null,null,"TX",1500,200,15000,22800,150,"TX 1500-200"]
[null,null,null,"TX",1500,250,15000,23000,150,"TX 1500-250"]
[null,null,null,"TX",1500,300,15000,23200,150,"TX 1500-300"]
[null,null,null,"TX",2400,25,24000,37100,150,"TX 2400-25"]
[null,null,null,"TX",2400,38,24000,37600,150,"TX 2400-38"]
[null,null,null,"TX",2400,50,24000,37900,150,"TX 2400-50"]
[null,null,null,"TX",2400,63,24000,38100,150,"TX 2400-63"]
[null,null,null,"TX",2400,75,24000,38300,150,"TX 2400-75"]
[null,null,null,"TX",2400,80,24000,38300,150,"TX 2400-80"]
[null,null,null,"TX",2400,100,24000,38500,150,"TX 2400-100"]
[null,null,null,"TX",2400,125,24000,38700,150,"TX 2400-125"]
[null,null,null,"TX",2400,150,24000,38800,150,"TX 2400-150"]
[null,null,null,"TX",2400,160,24000,38800,150,"TX 2400-160"]
[null,null,null,"TX",2400,175,24000,38900,150,"TX 2400-175"]
[null,null,null,"TX",2400,200,24000,38900,150,"TX 2400-200"]
[null,null,null,"TX",2400,250,24000,39000,150,"TX 2400-250"]
[null,null,null,"TX",2400,300,24000,39100,150,"TX 2400-300"]
[null,null,null,"TX",4200,25,42000,52100,150,"TX 4200-25"]
[null,null,null,"TX",4200,38,42000,55100,150,"TX 4200-38"]
[null,null,null,"TX",4200,50,42000,57200,150,"TX 4200-50"]
[null,null,null,"TX",4200,63,42000,59000,150,"TX 4200-63"]
[null,null,null,"TX",4200,75,42000,60300,150,"TX 4200-75"]
[null,null,null,"TX",4200,80,42000,60800,150,"TX 4200-80"]
[null,null,null,"TX",4200,100,42000,62500,150,"TX 4200-100"]
[null,null,null,"TX",4200,125,42000,64000,150,"TX 4200-125"]
[null,null,null,"TX",4200,150,42000,65100,150,"TX 4200-150"]
[null,null,null,"TX",4200,160,42000,65500,150,"TX 4200-160"]
[null,null,null,"TX",4200,175,42000,66000,150,"TX 4200-175"]
[null,null,null,"TX",4200,200,42000,66800,150,"TX 4200-200"]
[null,null,null,"TX",4200,250,42000,67900,150,"TX 4200-250"]
[null,null,null,"TX",4200,300,42000,68700,150,"TX 4200-300"]
[null,null,null,"TX",6600,25,66300,79500,150,"TX 6600-25"]
[null,null,null,"TX",6600,38,66300,83900,150,"TX 6600-38"]
[null,null,null,"TX",6600,50,66300,87000,150,"TX 6600-50"]
[null,null,null,"TX",6600,63,66300,89700,150,"TX 6600-63"]
[null,null,null,"TX",6600,75,66300,91800,150,"TX 6600-75"]
[null,null,null,"TX",6600,80,66300,92600,150,"TX 6600-80"]
[null,null,null,"TX",6600,100,66300,95100,150,"TX 6600-100"]
[null,null,null,"TX",6600,125,66300,97600,150,"TX 6600-125"]
[null,null,null,"TX",6600,150,66300,99500,150,"TX 6600-150"]
[null,null,null,"TX",6600,160,66300,100100,150,"TX 6600-160"]
[null,null,null,"TX",6600,175,66300,101000,150,"TX 6600-175"]
[null,null,null,"TX",6600,200,66300,102200,150,"TX 6600-200"]
[null,null,null,"TX",6600,250,66300,104000,150,"TX 6600-250"]
[null,null,null,"TX",6600,300,66300,105300,150,"TX 6600-300"]
[null,null,null,"TX",9500,25,95000,113200,150,"TX 9500-25"]
[null,null,null,"TX",9500,38,95000,119000,150,"TX 9500-38"]
[null,null,null,"TX",9500,50,95000,123300,150,"TX 9500-50"]
[null,null,null,"TX",9500,63,95000,127000,150,"TX 9500-63"]
[null,null,null,"TX",9500,75,95000,129700,150,"TX 9500-75"]
[null,null,null,"TX",9500,80,95000,130800,150,"TX 9500-80"]
[null,null,null,"TX",9500,100,95000,134300,150,"TX 9500-100"]
[null,null,null,"TX",9500,125,95000,137600,150,"TX 9500-125"]
[null,null,null,"TX",9500,150,95000,140200,150,"TX 9500-150"]
[null,null,null,"TX",9500,160,95000,141000,150,"TX 9500-160"]
[null,null,null,"TX",9500,175,95000,142200,150,"TX 9500-175"]
[null,null,null,"TX",9500,200,95000,143800,150,"TX 9500-200"]
[null,null,null,"TX",9500,250,95000,146300,150,"TX 9500-250"]
[null,null,null,"TX",9500,300,95000,148200,150,"TX 9500-300"]
[null,null,null,"TX",20000,25,200000,242000,150,"TX 20000-25"]
[null,null,null,"TX",20000,38,200000,256400,150,"TX 20000-38"]
[null,null,null,"TX",20000,50,200000,266800,150,"TX 20000-50"]
[null,null,null,"TX",20000,63,200000,276000,150,"TX 20000-63"]
[null,null,null,"TX",20000,75,200000,283100,150,"TX 20000-75"]
[null,null,null,"TX",20000,80,200000,285700,150,"TX 20000-80"]
[null,null,null,"TX",20000,100,200000,294600,150,"TX 20000-100"]
[null,null,null,"TX",20000,125,200000,303100,150,"TX 20000-125"]
[null,null,null,"TX",20000,150,200000,309700,150,"TX 20000-150"]
[null,null,null,"TX",20000,160,200000,312000,150,"TX 20000-160"]
[null,null,null,"TX",20000,175,200000,315000,150,"TX 20000-175"]
[null,null,null,"TX",20000,200,200000,319000,150,"TX 20000-200"]
[null,null,null,"TX",20000,250,200000,325600,150,"TX 20000-250"]
[null,null,null,"TX",20000,300,200000,330600,150,"TX 20000-300"]
[null,null,null,"R19","R19",7,900,1600,180,"R19-7"]
[null,null,null,"R19","R19",10,900,1400,180,"R19-10"]
[null,null,null,"R19","R19",15,900,1300,180,"R19-15"]
[null,null,null,"R19","R19",25,900,1300,180,"R19-25"]
[null,null,null,"R19","R19",38.1,900,1200,180,"R19-38,1"]
[null,null,null,"R19","R19",50,900,1200,180,"R19-50"]
[null,null,null,"R19","R19",63.5,900,1200,180,"R19-63,5"]
[null,null,null,"R19","R19",80,900,1200,180,"R19-80"]
[null,null,null,"R19","R19",100,900,1200,180,"R19-100"]
[null,null,null,"R19","R19",125,900,1200,180,"R19-125"]
[null,null,null,"M2","M2",10,2000,3060,180,"M2-10"]
[null,null,null,"M2","M2",12.7,2000,3070,180,"M2-12,7"]
[null,null,null,"M2","M2",15,2000,3070,180,"M2-15"]
[null,null,null,"M2","M2",16,2000,3070,180,"M2-16"]
[null,null,null,"M2","M2",25,2000,3080,180,"M2-25"]
[null,null,null,"M2","M2",38.1,2000,3090,180,"M2-38,1"]
[null,null,null,"M2","M2",50,2000,3090,180,"M2-50"]
[null,null,null,"M2","M2",63.5,2000,3020,180,"M2-63,5"]
[null,null,null,"M2","M2",80,2000,3040,180,"M2-80"]
[null,null,null,"M2","M2",100,2000,3050,180,"M2-100"]
[null,null,null,"M2","M2",125,2000,3060,180,"M2-125"]
[null,null,null,"MC3","MC3",10,2000,3060,180,"MC3-10"]
[null,null,null,"MC3","MC3",12.7,2000,3070,180,"MC3-12,7"]
[null,null,null,"MC3","MC3",16,2000,3070,180,"MC3-16"]
[null,null,null,"MC3","MC3",25,2000,3080,180,"MC3-25"]
[null,null,null,"MC3","MC3",38.1,2000,3090,180,"MC3-38,1"]
[null,null,null,"MC3","MC3",50,2000,3090,180,"MC3-50"]
[null,null,null,"MC3","MC3",63.5,2000,3020,180,"MC3-63,5"]
[null,null,null,"MC3","MC3",80,2000,3040,180,"MC3-80"]
[null,null,null,"MC3","MC3",100,2000,3050,180,"MC3-100"]
[null,null,null,"MC3","MC3",125,2000,3060,180,"MC3-125"]
[null,null,null,"CU4",420,6,4250,7300,150,"CU4 420-6"]
[null,null,null,"CU4",420,10,4250,7300,150,"CU4 420-10"]
[null,null,null,"CU4",420,16,4250,7300,150,"CU4 420-16"]
[null,null,null,"CU4",420,25,4250,7400,150,"CU4 420-25"]
[null,null,null,"CU4",420,32,4250,7900,150,"CU4 420-32"]
[null,null,null,"CU4",420,40,4250,8000,150,"CU4 420-40"]
[null,null,null,"CU4",420,50,4250,8000,150,"CU4 420-50"]
[null,null,null,"CU4",740,6,7400,10000,150,"CU4 740-6"]
[null,null,null,"CU4",740,10,7400,10000,150,"CU4 740-10"]
[null,null,null,"CU4",740,16,7400,11000,150,"CU4 740-16"]
[null,null,null,"CU4",740,25,7400,12000,150,"CU4 740-25"]
[null,null,null,"CU4",740,32,7400,12000,150,"CU4 740-32"]
[null,null,null,"CU4",740,40,7400,12000,150,"CU4 740-40"]
[null,null,null,"CU4",740,50,7400,12000,150,"CU4 740-50"]
[null,null,null,"CU4",1000,6,10600,16000,150,"CU4 1000-6"]
[null,null,null,"CU4",1000,10,10600,16000,150,"CU4 1000-10"]
[null,null,null,"CU4",1000,16,10600,16000,150,"CU4 1000-16"]
[null,null,null,"CU4",1000,25,10600,16000,150,"CU4 1000-25"]
[null,null,null,"CU4",1000,32,10600,16000,150,"CU4 1000-32"]
[null,null,null,"CU4",1000,40,10600,16000,150,"CU4 1000-40"]
[null,null,null,"CU4",1000,50,10600,16000,150,"CU4 1000-50"]
[null,null,null,"CU4",1800,6,18000,24000,150,"CU4 1800-6"]
[null,null,null,"CU4",1800,10,18000,25000,150,"CU4 1800-10"]
[null,null,null,"CU4",1800,16,18000,25000,150,"CU4 1800-16"]
[null,null,null,"CU4",1800,25,18000,26000,150,"CU4 1800-25"]
[null,null,null,"CU4",1800,32,18000,26000,150,"CU4 1800-32"]
[null,null,null,"CU4",1800,40,18000,26000,150,"CU4 1800-40"]
[null,null,null,"CU4",1800,50,18000,27000,150,"CU4 1800-50"]
[null,null,null,"CU4",1800,65,18000,28000,150,"CU4 1800-65"]
[null,null,null,"CU4",2900,10,29500,40000,150,"CU4 2900-10"]
[null,null,null,"CU4",2900,16,29500,42000,150,"CU4 2900-16"]
[null,null,null,"CU4",2900,25,29500,45000,150,"CU4 2900-25"]
[null,null,null,"CU4",2900,32,29500,46200,150,"CU4 2900-32"]
[null,null,null,"CU4",2900,40,29500,47200,150,"CU4 2900-40"]
[null,null,null,"CU4",2900,50,29500,45000,150,"CU4 2900-50"]
[null,null,null,"CU4",2900,65,29500,47000,150,"CU4 2900-65"]
[null,null,null,"CU4",4700,10,47000,67000,150,"CU4 4700-10"]
[null,null,null,"CU4",4700,16,47000,66000,150,"CU4 4700-16"]
[null,null,null,"CU4",4700,25,47000,68000,150,"CU4 4700-25"]
[null,null,null,"CU4",4700,32,47000,67000,150,"CU4 4700-32"]
[null,null,null,"CU4",4700,40,47000,67000,150,"CU4 4700-40"]
[null,null,null,"CU4",4700,50,47000,67000,150,"CU4 4700-50"]
[null,null,null,"CU4",4700,65,47000,71000,150,"CU4 4700-65"]
[null,null,null,"CU4",7500,10,75000,98500,150,"CU4 7500-10"]
[null,null,null,"CU4",7500,16,75000,100000,150,"CU4 7500-16"]
[null,null,null,"CU4",7500,25,75000,104000,150,"CU4 7500-25"]
[null,null,null,"CU4",7500,32,75000,102000,150,"CU4 7500-32"]
[null,null,null,"CU4",7500,40,75000,104000,150,"CU4 7500-40"]
[null,null,null,"CU4",7500,50,75000,103000,150,"CU4 7500-50"]
[null,null,null,"CU4",7500,65,75000,111000,150,"CU4 7500-65"]
[null,null,null,"CU4",11800,10,118000,150000,150,"CU4 11800-10"]
[null,null,null,"CU4",11800,16,118000,153000,150,"CU4 11800-16"]
[null,null,null,"CU4",11800,25,118000,160000,150,"CU4 11800-25"]
[null,null,null,"CU4",11800,32,118000,165000,150,"CU4 11800-32"]
[null,null,null,"CU4",11800,40,118000,160000,150,"CU4 11800-40"]
[null,null,null,"CU4",11800,50,118000,161000,150,"CU4 11800-50"]
[null,null,null,"CU4",11800,65,118000,163000,150,"CU4 11800-65"]
[null,null,null,"CU4",18300,10,183000,227000,150,"CU4 18300-10"]
[null,null,null,"CU4",18300,16,183000,233000,150,"CU4 18300-16"]
[null,null,null,"CU4",18300,25,183000,244000,150,"CU4 18300-25"]
[null,null,null,"CU4",18300,32,183000,244000,150,"CU4 18300-32"]
[null,null,null,"CU4",18300,40,183000,244000,150,"CU4 18300-40"]
[null,null,null,"CU4",18300,50,183000,248000,150,"CU4 18300-50"]
[null,null,null,"CU4",18300,65,183000,253000,150,"CU4 18300-65"]
[null,null,null,"CX",500,10,5100,6600,200,"CX 500-10"]
[null,null,null,"CX",500,15,5100,7100,200,"CX 500-15"]
[null,null,null,"CX",500,25,5100,7900,200,"CX 500-25"]
[null,null,null,"CX",500,38,5100,8700,200,"CX 500-38"]
[null,null,null,"CX",500,50,5100,9100,200,"CX 500-50"]
[null,null,null,"CX",500,63,5100,8800,200,"CX 500-63"]
[null,null,null,"CX",500,80,5100,9200,200,"CX 500-80"]
[null,null,null,"CX",1000,10,9800,13300,200,"CX 1000-10"]
[null,null,null,"CX",1000,15,9800,14400,200,"CX 1000-15"]
[null,null,null,"CX",1000,25,9800,16100,200,"CX 1000-25"]
[null,null,null,"CX",1000,38,9800,16900,200,"CX 1000-38"]
[null,null,null,"CX",1000,50,9800,17700,200,"CX 1000-50"]
[null,null,null,"CX",1000,63,9800,16500,200,"CX 1000-63"]
[null,null,null,"CX",1000,80,9800,17300,200,"CX 1000-80"]
[null,null,null,"CX",1900,10,19200,26300,200,"CX 1900-10"]
[null,null,null,"CX",1900,15,19200,31800,200,"CX 1900-15"]
[null,null,null,"CX",1900,25,19200,30900,200,"CX 1900-25"]
[null,null,null,"CX",1900,38,19200,31900,200,"CX 1900-38"]
[null,null,null,"CX",1900,50,19200,33800,200,"CX 1900-50"]
[null,null,null,"CX",1900,63,19200,34800,200,"CX 1900-63"]
[null,null,null,"CX",1900,80,19200,35600,200,"CX 1900-80"]
[null,null,null,"K",500,6,4700,5600,150,"K 500-6"]
[null,null,null,"K",500,12.5,4700,5900,150,"K 500-12,5"]
[null,null,null,"K",500,19,4700,6100,150,"K 500-19"]
[null,null,null,"K",500,25,4700,6100,150,"K 500-25"]
[null,null,null,"K",500,38.1,4700,6200,150,"K 500-38,1"]
[null,null,null,"K",500,50,4700,6300,150,"K 500-50"]
[null,null,null,"K",500,63.5,4700,6300,150,"K 500-63,5"]
[null,null,null,"K",500,80,4700,6600,150,"K 500-80"]
[null,null,null,"K",500,100,4700,6600,150,"K 500-100"]
[null,null,null,"K",500,125,4700,6600,150,"K 500-125"]
[null,null,null,"K",750,6,7400,15000,150,"K 750-6"]
[null,null,null,"K",750,12.5,7400,13000,150,"K 750-12,5"]
[null,null,null,"K",750,19,7400,12000,150,"K 750-19"]
[null,null,null,"K",750,25,7400,11000,150,"K 750-25"]
[null,null,null,"K",750,38.1,7400,11000,150,"K 750-38,1"]
[null,null,null,"K",750,50,7400,11000,150,"K 750-50"]
[null,null,null,"K",750,63.5,7400,11000,150,"K 750-63,5"]
[null,null,null,"K",750,80,7400,11000,150,"K 750-80"]
[null,null,null,"K",750,100,7400,11000,150,"K 750-100"]
[null,null,null,"K",750,125,7400,11000,150,"K 750-125"]
[null,null,null,"K",1500,25,15000,24000,150,"K 1500-25"]
[null,null,null,"K",1500,38.1,15000,23000,150,"K 1500-38,1"]
[null,null,null,"K",1500,50,15000,23000,150,"K 1500-50"]
[null,null,null,"K",1500,63.5,15000,23000,150,"K 1500-63,5"]
[null,null,null,"K",1500,80,15000,23000,150,"K 1500-80"]
[null,null,null,"K",1500,100,15000,23000,150,"K 1500-100"]
[null,null,null,"LCF",750,12.7,7400,12000,150,"LCF 750-12,7"]
[null,null,null,"LCF",750,25,7400,12000,150,"LCF 750-25"]
[null,null,null,"LCF",750,38.1,7400,12000,150,"LCF 750-38,1"]
[null,null,null,"LCF",750,50,7400,12000,150,"LCF 750-50"]
[null,null,null,"LCF",750,63.5,7400,12000,150,"LCF 750-63,5"]
[null,null,null,"LCF",750,80,7400,12000,150,"LCF 750-80"]
[null,null,null,"LCF",750,100,7400,12000,150,"LCF 750-100"]
[null,null,null,"LCF",750,125,7400,12100,150,"LCF 750-125"]
[null,null,null,"LCF",750,160,7400,12100,150,"LCF 750-160"]
[null,null,null,"LCF",750,200,7400,12100,150,"LCF 750-200"]
[null,null,null,"LCF",750,250,7400,12100,150,"LCF 750-250"]
[null,null,null,"LCF",750,300,7400,12100,150,"LCF 750-300"]
[null,null,null,"LCF",1500,25,15000,23000,150,"LCF 1500-25"]
[null,null,null,"LCF",1500,38.1,15000,23000,150,"LCF 1500-38,1"]
[null,null,null,"LCF",1500,50,15000,23000,150,"LCF 1500-50"]
[null,null,null,"LCF",1500,63.5,15000,23000,150,"LCF 1500-63,5"]
[null,null,null,"LCF",1500,80,15000,23000,150,"LCF 1500-80"]
[null,null,null,"LCF",1500,100,15000,23000,150,"LCF 1500-100"]
[null,null,null,"LCF",1500,125,15000,23000,150,"LCF 1500-125"]
[null,null,null,"LCF",1500,160,15000,23000,150,"LCF 1500-160"]
[null,null,null,"LCF",1500,200,15000,23000,150,"LCF 1500-200"]
[null,null,null,"LCF",1500,250,15000,23000,150,"LCF 1500-250"]
[null,null,null,"LCF",1500,300,15000,23000,150,"LCF 1500-300"]
[null,null,null,"LCF",3000,25,30000,42000,150,"LCF 3000-25"]
[null,null,null,"LCF",3000,38.1,30000,43000,150,"LCF 3000-38,1"]
[null,null,null,"LCF",3000,50,30000,44000,150,"LCF 3000-50"]
[null,null,null,"LCF",3000,63.5,30000,45000,150,"LCF 3000-63,5"]
[null,null,null,"LCF",3000,80,30000,46000,150,"LCF 3000-80"]
[null,null,null,"LCF",3000,100,30000,47000,150,"LCF 3000-100"]
[null,null,null,"LCF",3000,125,30000,47000,150,"LCF 3000-125"]
[null,null,null,"LCF",3000,160,30000,47000,150,"LCF 3000-160"]
[null,null,null,"LCF",3000,200,30000,48000,150,"LCF 3000-200"]
[null,null,null,"LCF",3000,250,30000,48000,150,"LCF 3000-250"]
[null,null,null,"LCF",3000,300,30000,48000,150,"LCF 3000-300"]
[null,null,null,"LCF",5000,25,50000,71000,150,"LCF 5000-25"]
[null,null,null,"LCF",5000,38.1,50000,75000,150,"LCF 5000-38,1"]
[null,null,null,"LCF",5000,50,50000,77000,150,"LCF 5000-50"]
[null,null,null,"LCF",5000,63.5,50000,80000,150,"LCF 5000-63,5"]
[null,null,null,"LCF",5000,80,50000,81000,150,"LCF 5000-80"]
[null,null,null,"LCF",5000,100,50000,82000,150,"LCF 5000-100"]
[null,null,null,"LCF",5000,125,50000,82000,150,"LCF 5000-125"]
[null,null,null,"LCF",5000,160,50000,83000,150,"LCF 5000-160"]
[null,null,null,"LCF",5000,200,50000,84000,150,"LCF 5000-200"]
[null,null,null,"LCF",5000,250,50000,84000,150,"LCF 5000-250"]
[null,null,null,"LCF",5000,300,50000,84000,150,"LCF 5000-300"]
[null,null,null,"LCF",7500,25,75000,105000,150,"LCF 7500-25"]
[null,null,null,"LCF",7500,38.1,75000,110000,150,"LCF 7500-38,1"]
[null,null,null,"LCF",7500,50,75000,113000,150,"LCF 7500-50"]
[null,null,null,"LCF",7500,63.5,75000,115000,150,"LCF 7500-63,5"]
[null,null,null,"LCF",7500,80,75000,117000,150,"LCF 7500-80"]
[null,null,null,"LCF",7500,100,75000,119000,150,"LCF 7500-100"]
[null,null,null,"LCF",7500,125,75000,121000,150,"LCF 7500-125"]
[null,null,null,"LCF",7500,160,75000,122000,150,"LCF 7500-160"]
[null,null,null,"LCF",7500,200,75000,123000,150,"LCF 7500-200"]
[null,null,null,"LCF",7500,250,75000,124000,150,"LCF 7500-250"]
[null,null,null,"LCF",7500,300,75000,124000,150,"LCF 7500-300"]
[null,null,null,"XG",350,10,3600,5900,180,"XG 350-10"]
[null,null,null,"XG",350,13,3600,5200,180,"XG 350-13"]
[null,null,null,"XG",350,16,3600,5300,180,"XG 350-16"]
[null,null,null,"XG",350,19,3600,5600,180,"XG 350-19"]
[null,null,null,"XG",350,25,3600,5500,180,"XG 350-25"]
[null,null,null,"XG",350,32,3600,5500,180,"XG 350-32"]
[null,null,null,"XG",350,38,3600,5500,180,"XG 350-38"]
[null,null,null,"XG",350,50,3600,5600,180,"XG 350-50"]
[null,null,null,"XG",350,63,3600,5500,180,"XG 350-63"]
[null,null,null,"XG",350,75,3600,5500,180,"XG 350-75"]
[null,null,null,"XG",350,80,3600,5500,180,"XG 350-80"]
[null,null,null,"XG",350,100,3600,5500,180,"XG 350-100"]
[null,null,null,"XG",350,125,3600,5500,180,"XG 350-125"]
[null,null,null,"XG",500,10,4700,7200,150,"XG 500-10"]
[null,null,null,"XG",500,13,4700,7100,150,"XG 500-13"]
[null,null,null,"XG",500,16,4700,7200,150,"XG 500-16"]
[null,null,null,"XG",500,19,4700,7400,150,"XG 500-19"]
[null,null,null,"XG",500,25,4700,7300,150,"XG 500-25"]
[null,null,null,"XG",500,32,4700,7200,150,"XG 500-32"]
[null,null,null,"XG",500,38,4700,7200,150,"XG 500-38"]
[null,null,null,"XG",500,50,4700,7200,150,"XG 500-50"]
[null,null,null,"XG",500,63,4700,7200,150,"XG 500-63"]
[null,null,null,"XG",500,75,4700,7100,150,"XG 500-75"]
[null,null,null,"XG",500,80,4700,7100,150,"XG 500-80"]
[null,null,null,"XG",500,100,4700,7100,150,"XG 500-100"]
[null,null,null,"XG",500,125,4700,7100,150,"XG 500-125"]
[null,null,null,"XG",750,10,7400,12100,150,"XG 750-10"]
[null,null,null,"XG",750,13,7400,12100,150,"XG 750-13"]
[null,null,null,"XG",750,16,7400,12100,150,"XG 750-16"]
[null,null,null,"XG",750,19,7400,11700,150,"XG 750-19"]
[null,null,null,"XG",750,25,7400,11800,150,"XG 750-25"]
[null,null,null,"XG",750,32,7400,11800,150,"XG 750-32"]
[null,null,null,"XG",750,38,7400,11800,150,"XG 750-38"]
[null,null,null,"XG",750,50,7400,11800,150,"XG 750-50"]
[null,null,null,"XG",750,63,7400,11800,150,"XG 750-63"]
[null,null,null,"XG",750,75,7400,11900,150,"XG 750-75"]
[null,null,null,"XG",750,80,7400,11900,150,"XG 750-80"]
[null,null,null,"XG",750,100,7400,11900,150,"XG 750-100"]
[null,null,null,"XG",750,125,7400,11900,150,"XG 750-125"]
[null,null,null,"XG",1000,13,9200,13800,150,"XG 1000-13"]
[null,null,null,"XG",1000,16,9200,13800,150,"XG 1000-16"]
[null,null,null,"XG",1000,19,9200,14000,150,"XG 1000-19"]
[null,null,null,"XG",1000,25,9200,14200,150,"XG 1000-25"]
[null,null,null,"XG",1000,32,9200,14300,150,"XG 1000-32"]
[null,null,null,"XG",1000,38,9200,14500,150,"XG 1000-38"]
[null,null,null,"XG",1000,50,9200,14600,150,"XG 1000-50"]
[null,null,null,"XG",1000,63,9200,14700,150,"XG 1000-63"]
[null,null,null,"XG",1000,75,9200,14700,150,"XG 1000-75"]
[null,null,null,"XG",1000,80,9200,14800,150,"XG 1000-80"]
[null,null,null,"XG",1000,100,9200,14800,150,"XG 1000-100"]
[null,null,null,"XG",1000,125,9200,14800,150,"XG 1000-125"]
[null,null,null,"XG",1500,13,15000,24000,150,"XG 1500-13"]
[null,null,null,"XG",1500,16,15000,24100,150,"XG 1500-16"]
[null,null,null,"XG",1500,19,15000,24200,150,"XG 1500-19"]
[null,null,null,"XG",1500,25,15000,24300,150,"XG 1500-25"]
[null,null,null,"XG",1500,32,15000,23800,150,"XG 1500-32"]
[null,null,null,"XG",1500,38,15000,23900,150,"XG 1500-38"]
[null,null,null,"XG",1500,50,15000,24000,150,"XG 1500-50"]
[null,null,null,"XG",1500,63,15000,24100,150,"XG 1500-63"]
[null,null,null,"XG",1500,75,15000,24200,150,"XG 1500-75"]
[null,null,null,"XG",1500,80,15000,24200,150,"XG 1500-80"]
[null,null,null,"XG",1500,100,15000,24300,150,"XG 1500-100"]
[null,null,null,"XG",1500,125,15000,24300,150,"XG 1500-125"]
[null,null,null,"XG",2400,16,24000,38300,150,"XG 2400-16"]
[null,null,null,"XG",2400,19,24000,38500,150,"XG 2400-19"]
[null,null,null,"XG",2400,25,24000,38700,150,"XG 2400-25"]
[null,null,null,"XG",2400,32,24000,38600,150,"XG 2400-32"]
[null,null,null,"XG",2400,38,24000,38400,150,"XG 2400-38"]
[null,null,null,"XG",2400,50,24000,39200,150,"XG 2400-50"]
[null,null,null,"XG",2400,63,24000,39200,150,"XG 2400-63"]
[null,null,null,"XG",2400,75,24000,39200,150,"XG 2400-75"]
[null,null,null,"XG",2400,80,24000,39200,150,"XG 2400-80"]
[null,null,null,"XG",2400,100,24000,39300,150,"XG 2400-100"]
[null,null,null,"XG",2400,125,24000,39300,150,"XG 2400-125"]
[null,null,null,"XG",4200,16,42000,61700,150,"XG 4200-16"]
[null,null,null,"XG",4200,19,42000,63700,150,"XG 4200-19"]
[null,null,null,"XG",4200,25,42000,60800,150,"XG 4200-25"]
[null,null,null,"XG",4200,32,42000,64300,150,"XG 4200-32"]
[null,null,null,"XG",4200,38,42000,65800,150,"XG 4200-38"]
[null,null,null,"XG",4200,50,42000,67000,150,"XG 4200-50"]
[null,null,null,"XG",4200,63,42000,67800,150,"XG 4200-63"]
[null,null,null,"XG",4200,75,42000,68000,150,"XG 4200-75"]
[null,null,null,"XG",4200,80,42000,68600,150,"XG 4200-80"]
[null,null,null,"XG",4200,100,42000,69100,150,"XG 4200-100"]
[null,null,null,"XG",4200,125,42000,69600,150,"XG 4200-125"]
[null,null,null,"XG",6600,16,66300,89000,150,"XG 6600-16"]
[null,null,null,"XG",6600,19,66300,91000,150,"XG 6600-19"]
[null,null,null,"XG",6600,25,66300,93900,150,"XG 6600-25"]
[null,null,null,"XG",6600,32,66300,96100,150,"XG 6600-32"]
[null,null,null,"XG",6600,38,66300,98200,150,"XG 6600-38"]
[null,null,null,"XG",6600,50,66300,100600,150,"XG 6600-50"]
[null,null,null,"XG",6600,63,66300,102400,150,"XG 6600-63"]
[null,null,null,"XG",6600,75,66300,103400,150,"XG 6600-75"]
[null,null,null,"XG",6600,80,66300,104100,150,"XG 6600-80"]
[null,null,null,"XG",6600,100,66300,105400,150,"XG 6600-100"]
[null,null,null,"XG",6600,125,66300,106500,150,"XG 6600-125"]
[null,null,null,"R12","R12",7,500,597,180,"R12-7"]
[null,null,null,"R12","R12",10,500,634,180,"R12-10"]
[null,null,null,"R12","R12",12.7,500,657,180,"R12-12,7"]
[null,null,null,"R12","R12",15,500,670,180,"R12-15"]
[null,null,null,"R12","R12",19,500,689,180,"R12-19"]
[null,null,null,"R12","R12",25,500,707,180,"R12-25"]
[null,null,null,"R12","R12",38.1,500,730,180,"R12-38,1"]
[null,null,null,"R12","R12",50,500,742,180,"R12-50"]
[null,null,null,"R12","R12",63.5,500,789,180,"R12-63,5"]
[null,null,null,"R12","R12",75,500,788,180,"R12-75"]
[null,null,null,"R12","R12",80,500,827,180,"R12-80"]
[null,null,null,"R12","R12",100,500,817,180,"R12-100"]
[null,null,null,"R12","R12",125,500,810,180,"R12-125"]
[null,null,null,"R15","R15",7,700,865,180,"R15-7"]
[null,null,null,"R15","R15",10,700,895,180,"R15-10"]
[null,null,null,"R15","R15",12.7,700,914,180,"R15-12,7"]
[null,null,null,"R15","R15",15,700,927,180,"R15-15"]
[null,null,null,"R15","R15",19,700,943,180,"R15-19"]
[null,null,null,"R15","R15",25,700,961,180,"R15-25"]
[null,null,null,"R15","R15",38.1,700,1032,180,"R15-38,1"]
[null,null,null,"R15","R15",50,700,1033,180,"R15-50"]
[null,null,null,"R15","R15",63.5,700,1092,180,"R15-63,5"]
[null,null,null,"R15","R15",75,700,1082,180,"R15-75"]
[null,null,null,"R15","R15",80,700,1079,180,"R15-80"]
[null,null,null,"R15","R15",100,700,1069,180,"R15-100"]
[null,null,null,"R15","R15",125,700,1062,180,"R15-125"]
[null,null,null,"TL",750,12.5,7400,11400,150,"TL 750-12,5"]
[null,null,null,"TL",750,25,7400,11700,150,"TL 750-25"]
[null,null,null,"TL",750,37.5,7400,11800,150,"TL 750-37,5"]
[null,null,null,"TL",750,50,7400,11900,150,"TL 750-50"]
[null,null,null,"TL",750,62.5,7400,11900,150,"TL 750-62,5"]
[null,null,null,"TL",750,75,7400,11900,150,"TL 750-75"]
[null,null,null,"TL",750,80,7400,11900,150,"TL 750-80"]
[null,null,null,"TL",750,87.5,7400,11900,150,"TL 750-87,5"]
[null,null,null,"TL",750,100,7400,11900,150,"TL 750-100"]
[null,null,null,"TL",750,112.5,7400,12000,150,"TL 750-112,5"]
[null,null,null,"TL",750,125,7400,12000,150,"TL 750-125"]
[null,null,null,"TL",750,137.5,7400,12000,150,"TL 750-137,5"]
[null,null,null,"TL",750,150,7400,12000,150,"TL 750-150"]
[null,null,null,"TL",750,160,7400,12000,150,"TL 750-160"]
[null,null,null,"TL",750,175,7400,12000,150,"TL 750-175"]
[null,null,null,"TL",750,200,7400,12000,150,"TL 750-200"]
[null,null,null,"TL",750,225,7400,12000,150,"TL 750-225"]
[null,null,null,"TL",750,250,7400,12000,150,"TL 750-250"]
[null,null,null,"TL",1500,12.5,15000,18000,150,"TL 1500-12,5"]
[null,null,null,"TL",1500,25,15000,19200,150,"TL 1500-25"]
[null,null,null,"TL",1500,37.5,15000,20000,150,"TL 1500-37,5"]
[null,null,null,"TL",1500,50,15000,20400,150,"TL 1500-50"]
[null,null,null,"TL",1500,62.5,15000,20700,150,"TL 1500-62,5"]
[null,null,null,"TL",1500,75,15000,20900,150,"TL 1500-75"]
[null,null,null,"TL",1500,80,15000,21000,150,"TL 1500-80"]
[null,null,null,"TL",1500,87.5,15000,21100,150,"TL 1500-87,5"]
[null,null,null,"TL",1500,100,15000,21200,150,"TL 1500-100"]
[null,null,null,"TL",1500,112.5,15000,21400,150,"TL 1500-112,5"]
[null,null,null,"TL",1500,125,15000,21500,150,"TL 1500-125"]
[null,null,null,"TL",1500,137.5,15000,22000,150,"TL 1500-137,5"]
[null,null,null,"TL",1500,150,15000,22000,150,"TL 1500-150"]
[null,null,null,"TL",1500,160,15000,22100,150,"TL 1500-160"]
[null,null,null,"TL",1500,175,15000,22100,150,"TL 1500-175"]
[null,null,null,"TL",1500,200,15000,22100,150,"TL 1500-200"]
[null,null,null,"TL",1500,225,15000,22200,150,"TL 1500-225"]
[null,null,null,"TL",1500,250,15000,22200,150,"TL 1500-250"]
[null,null,null,"TL",3000,12.5,30000,38700,150,"TL 3000-12,5"]
[null,null,null,"TL",3000,25,30000,41800,150,"TL 3000-25"]
[null,null,null,"TL",3000,37.5,30000,43500,150,"TL 3000-37,5"]
[null,null,null,"TL",3000,50,30000,44400,150,"TL 3000-50"]
[null,null,null,"TL",3000,62.5,30000,45100,150,"TL 3000-62,5"]
[null,null,null,"TL",3000,75,30000,45500,150,"TL 3000-75"]
[null,null,null,"TL",3000,80,30000,45600,150,"TL 3000-80"]
[null,null,null,"TL",3000,87.5,30000,45800,150,"TL 3000-87,5"]
[null,null,null,"TL",3000,100,30000,46100,150,"TL 3000-100"]
[null,null,null,"TL",3000,112.5,30000,46300,150,"TL 3000-112,5"]
[null,null,null,"TL",3000,125,30000,46500,150,"TL 3000-125"]
[null,null,null,"TL",3000,137.5,30000,46600,150,"TL 3000-137,5"]
[null,null,null,"TL",3000,150,30000,46800,150,"TL 3000-150"]
[null,null,null,"TL",3000,160,30000,46900,150,"TL 3000-160"]
[null,null,null,"TL",3000,175,30000,47000,150,"TL 3000-175"]
[null,null,null,"TL",3000,200,30000,47100,150,"TL 3000-200"]
[null,null,null,"TL",3000,225,30000,47200,150,"TL 3000-225"]
[null,null,null,"TL",3000,250,30000,47300,150,"TL 3000-250"]
[null,null,null,"TL",5000,25,50000,80100,150,"TL 5000-25"]
[null,null,null,"TL",5000,37.5,50000,81900,150,"TL 5000-37,5"]
[null,null,null,"TL",5000,50,50000,82800,150,"TL 5000-50"]
[null,null,null,"TL",5000,62.5,50000,83500,150,"TL 5000-62,5"]
[null,null,null,"TL",5000,75,50000,83800,150,"TL 5000-75"]
[null,null,null,"TL",5000,80,50000,84000,150,"TL 5000-80"]
[null,null,null,"TL",5000,87.5,50000,84100,150,"TL 5000-87,5"]
[null,null,null,"TL",5000,100,50000,84400,150,"TL 5000-100"]
[null,null,null,"TL",5000,112.5,50000,84500,150,"TL 5000-112,5"]
[null,null,null,"TL",5000,125,50000,84700,150,"TL 5000-125"]
[null,null,null,"TL",5000,137.5,50000,84800,150,"TL 5000-137,5"]
[null,null,null,"TL",5000,150,50000,84900,150,"TL 5000-150"]
[null,null,null,"TL",5000,160,50000,85000,150,"TL 5000-160"]
[null,null,null,"TL",5000,175,50000,85100,150,"TL 5000-175"]
[null,null,null,"TL",5000,200,50000,85200,150,"TL 5000-200"]
[null,null,null,"TL",5000,225,50000,85300,150,"TL 5000-225"]
[null,null,null,"TL",5000,250,50000,85400,150,"TL 5000-250"]
[null,null,null,"TL",7500,25,75000,99900,150,"TL 7500-25"]
[null,null,null,"TL",7500,37.5,75000,104100,150,"TL 7500-37,5"]
[null,null,null,"TL",7500,50,75000,106800,150,"TL 7500-50"]
[null,null,null,"TL",7500,62.5,75000,108700,150,"TL 7500-62,5"]
[null,null,null,"TL",7500,75,75000,110100,150,"TL 7500-75"]
[null,null,null,"TL",7500,80,75000,115600,150,"TL 7500-80"]
[null,null,null,"TL",7500,87.5,75000,111200,150,"TL 7500-87,5"]
[null,null,null,"TL",7500,100,75000,112000,150,"TL 7500-100"]
[null,null,null,"TL",7500,112.5,75000,112700,150,"TL 7500-112,5"]
[null,null,null,"TL",7500,125,75000,113300,150,"TL 7500-125"]
[null,null,null,"TL",7500,137.5,75000,113700,150,"TL 7500-137,5"]
[null,null,null,"TL",7500,150,75000,114100,150,"TL 7500-150"]
[null,null,null,"TL",7500,160,75000,114400,150,"TL 7500-160"]
[null,null,null,"TL",7500,175,75000,114800,150,"TL 7500-175"]
[null,null,null,"TL",7500,200,75000,115300,150,"TL 7500-200"]
[null,null,null,"TL",7500,225,75000,115700,150,"TL 7500-225"]
[null,null,null,"TL",7500,250,75000,116000,150,"TL 7500-250"]
[null,null,null,"TUS",750,25,7400,12000,150,"TUS 750-25"]
[null,null,null,"TUS",750,38.1,7400,12000,150,"TUS 750-38,1"]
[null,null,null,"TUS",750,50,7400,12000,150,"TUS 750-50"]
[null,null,null,"TUS",750,63.5,7400,12000,150,"TUS 750-63,5"]
[null,null,null,"TUS",750,80,7400,12000,150,"TUS 750-80"]
[null,null,null,"TUS",750,100,7400,12000,150,"TUS 750-100"]
[null,null,null,"TUS",750,125,7400,12100,150,"TUS 750-125"]
[null,null,null,"TUS",750,160,7400,12100,150,"TUS 750-160"]
[null,null,null,"TUS",750,200,7400,12100,150,"TUS 750-200"]
[null,null,null,"TUS",750,250,7400,12100,150,"TUS 750-250"]
[null,null,null,"TUS",750,300,7400,12100,150,"TUS 750-300"]
[null,null,null,"TUS",1500,25,15000,23000,150,"TUS 1500-25"]
[null,null,null,"TUS",1500,38.1,15000,23000,150,"TUS 1500-38,1"]
[null,null,null,"TUS",1500,50,15000,23000,150,"TUS 1500-50"]
[null,null,null,"TUS",1500,63.5,15000,23000,150,"TUS 1500-63,5"]
[null,null,null,"TUS",1500,80,15000,23000,150,"TUS 1500-80"]
[null,null,null,"TUS",1500,100,15000,23000,150,"TUS 1500-100"]
[null,null,null,"TUS",1500,125,15000,23000,150,"TUS 1500-125"]
[null,null,null,"TUS",1500,160,15000,23000,150,"TUS 1500-160"]
[null,null,null,"TUS",1500,200,15000,23000,150,"TUS 1500-200"]
[null,null,null,"TUS",1500,250,15000,23000,150,"TUS 1500-250"]
[null,null,null,"TUS",1500,300,15000,23000,150,"TUS 1500-300"]
[null,null,null,"TUS",3000,25,30000,42000,150,"TUS 3000-25"]
[null,null,null,"TUS",3000,38.1,30000,43000,150,"TUS 3000-38,1"]
[null,null,null,"TUS",3000,50,30000,44000,150,"TUS 3000-50"]
[null,null,null,"TUS",3000,63.5,30000,45000,150,"TUS 3000-63,5"]
[null,null,null,"TUS",3000,80,30000,46000,150,"TUS 3000-80"]
[null,null,null,"TUS",3000,100,30000,47000,150,"TUS 3000-100"]
[null,null,null,"TUS",3000,125,30000,47000,150,"TUS 3000-125"]
[null,null,null,"TUS",3000,160,30000,47000,150,"TUS 3000-160"]
[null,null,null,"TUS",3000,200,30000,48000,150,"TUS 3000-200"]
[null,null,null,"TUS",3000,250,30000,48000,150,"TUS 3000-250"]
[null,null,null,"TUS",3000,300,30000,48000,150,"TUS 3000-300"]
[null,null,null,"TUS",5000,25,50000,71000,150,"TUS 5000-25"]
[null,null,null,"TUS",5000,38.1,50000,75000,150,"TUS 5000-38,1"]
[null,null,null,"TUS",5000,50,50000,77000,150,"TUS 5000-50"]
[null,null,null,"TUS",5000,63.5,50000,80000,150,"TUS 5000-63,5"]
[null,null,null,"TUS",5000,80,50000,81000,150,"TUS 5000-80"]
[null,null,null,"TUS",5000,100,50000,82000,150,"TUS 5000-100"]
[null,null,null,"TUS",5000,125,50000,82000,150,"TUS 5000-125"]
[null,null,null,"TUS",5000,160,50000,83000,150,"TUS 5000-160"]
[null,null,null,"TUS",5000,200,50000,84000,150,"TUS 5000-200"]
[null,null,null,"TUS",5000,250,50000,84000,150,"TUS 5000-250"]
[null,null,null,"TUS",5000,300,50000,84000,150,"TUS 5000-300"]
[null,null,null,"TUS",7500,25,75000,105000,150,"TUS 7500-25"]
[null,null,null,"TUS",7500,38.1,75000,110000,150,"TUS 7500-38,1"]
[null,null,null,"TUS",7500,50,75000,113000,150,"TUS 7500-50"]
[null,null,null,"TUS",7500,63.5,75000,115000,150,"TUS 7500-63,5"]
[null,null,null,"TUS",7500,80,75000,117000,150,"TUS 7500-80"]
[null,null,null,"TUS",7500,100,75000,119000,150,"TUS 7500-100"]
[null,null,null,"TUS",7500,125,75000,121000,150,"TUS 7500-125"]
[null,null,null,"TUS",7500,160,75000,122000,150,"TUS 7500-160"]
[null,null,null,"TUS",7500,200,75000,123000,150,"TUS 7500-200"]
[null,null,null,"TUS",7500,250,75000,124000,150,"TUS 7500-250"]
[null,null,null,"TUS",7500,300,75000,124000,150,"TUS 7500-300"]
[null,null,null,"TUR",10000,25,106000,138000,150,"TUR 10000-25"]
[null,null,null,"TUR",10000,38.1,106000,143000,150,"TUR 10000-38,1"]
[null,null,null,"TUR",10000,50,106000,147000,150,"TUR 10000-50"]
[null,null,null,"TUR",10000,63.5,106000,150000,150,"TUR 10000-63,5"]
[null,null,null,"TUR",10000,80,106000,152000,150,"TUR 10000-80"]
[null,null,null,"TUR",10000,100,106000,156000,150,"TUR 10000-100"]
[null,null,null,"TUR",10000,125,106000,157000,150,"TUR 10000-125"]
[null,null,null,"TUR",10000,160,106000,158000,150,"TUR 10000-160"]
[null,null,null,"TUR",10000,200,106000,160000,150,"TUR 10000-200"]
[null,null,null,"TUR",10000,250,106000,160000,150,"TUR 10000-250"]
[null,null,null,"TUR",10000,300,106000,160000,150,"TUR 10000-300"]
[null,null,null,"XF",750,10,7400,12100,150,"XF 750-10"]
[null,null,null,"XF",750,13,7400,12100,150,"XF 750-13"]
[null,null,null,"XF",750,16,7400,12100,150,"XF 750-16"]
[null,null,null,"XF",750,19,7400,11700,150,"XF 750-19"]
[null,null,null,"XF",750,25,7400,11800,150,"XF 750-25"]
[null,null,null,"XF",750,32,7400,11800,150,"XF 750-32"]
[null,null,null,"XF",750,38,7400,11800,150,"XF 750-38"]
[null,null,null,"XF",750,50,7400,11800,150,"XF 750-50"]
[null,null,null,"XF",750,63,7400,11800,150,"XF 750-63"]
[null,null,null,"XF",750,75,7400,11900,150,"XF 750-75"]
[null,null,null,"XF",750,80,7400,11900,150,"XF 750-80"]
[null,null,null,"XF",750,100,7400,11900,150,"XF 750-100"]
[null,null,null,"XF",750,125,7400,11900,150,"XF 750-125"]
[null,null,null,"XF",1000,13,9200,13800,150,"XF 1000-13"]
[null,null,null,"XF",1000,16,9200,13800,150,"XF 1000-16"]
[null,null,null,"XF",1000,19,9200,14000,150,"XF 1000-19"]
[null,null,null,"XF",1000,25,9200,14200,150,"XF 1000-25"]
[null,null,null,"XF",1000,32,9200,14300,150,"XF 1000-32"]
[null,null,null,"XF",1000,38,9200,14500,150,"XF 1000-38"]
[null,null,null,"XF",1000,50,9200,14600,150,"XF 1000-50"]
[null,null,null,"XF",1000,63,9200,14700,150,"XF 1000-63"]
[null,null,null,"XF",1000,75,9200,14700,150,"XF 1000-75"]
[null,null,null,"XF",1000,80,9200,14800,150,"XF 1000-80"]
[null,null,null,"XF",1000,100,9200,14800,150,"XF 1000-100"]
[null,null,null,"XF",1000,125,9200,14800,150,"XF 1000-125"]
[null,null,null,"XF",1500,13,15000,24000,150,"XF 1500-13"]
[null,null,null,"XF",1500,16,15000,24100,150,"XF 1500-16"]
[null,null,null,"XF",1500,19,15000,24200,150,"XF 1500-19"]
[null,null,null,"XF",1500,25,15000,24300,150,"XF 1500-25"]
[null,null,null,"XF",1500,32,15000,23800,150,"XF 1500-32"]
[null,null,null,"XF",1500,38,15000,23900,150,"XF 1500-38"]
[null,null,null,"XF",1500,50,15000,24000,150,"XF 1500-50"]
[null,null,null,"XF",1500,63,15000,24100,150,"XF 1500-63"]
[null,null,null,"XF",1500,75,15000,24200,150,"XF 1500-75"]
[null,null,null,"XF",1500,80,15000,24200,150,"XF 1500-80"]
[null,null,null,"XF",1500,100,15000,24300,150,"XF 1500-100"]
[null,null,null,"XF",1500,125,15000,24300,150,"XF 1500-125"]
[null,null,null,"XF",2400,16,24000,38300,150,"XF 2400-16"]
[null,null,null,"XF",2400,19,24000,38500,150,"XF 2400-19"]
[null,null,null,"XF",2400,25,24000,38700,150,"XF 2400-25"]
[null,null,null,"XF",2400,32,24000,38600,150,"XF 2400-32"]
[null,null,null,"XF",2400,38,24000,38400,150,"XF 2400-38"]
[null,null,null,"XF",2400,50,24000,39200,150,"XF 2400-50"]
[null,null,null,"XF",2400,63,24000,39200,150,"XF 2400-63"]
[null,null,null,"XF",2400,75,24000,39200,150,"XF 2400-75"]
[null,null,null,"XF",2400,80,24000,39200,150,"XF 2400-80"]
[null,null,null,"XF",2400,100,24000,39300,150,"XF 2400-100"]
[null,null,null,"XF",2400,125,24000,39300,150,"XF 2400-125"]

{"sheet":"Hyson-Kaller conv","index":10,"n_rows":916,"n_cols":7,"rows_kept":916,"cut":false,"hidden":false,"merged":[]}
[null,null,"Hyson Reference","Kaller Str Code",null,"Hyson Reference","Kaller Str Code"]
[null,null,"T2L-300","TU 250",null,"T2L-300x10","TU 250-10"]
[null,null,"NP-500","TU 500",null,"T2L-300x0.50","TU 250-12,7"]
[null,null,"NP-750","TU 750",null,"T2L-300x16","TU 250-16"]
[null,null,"NP-1500","TU 1500",null,"T2L-300x25","TU 250-25"]
[null,null,"NP-3000","TU 3000",null,"T2L-300x1.50","TU 250-38,1"]
[null,null,"NP-5000","TU 5000",null,"T2L-300x50","TU 250-50"]
[null,null,"NP-7500","TU 7500",null,"T2L-300x2.50","TU 250-63,5"]
[null,null,"NP-10000","TU 10000",null,"T2L-300x80","TU 250-80"]
[null,null,"T2L-500","K 500",null,"T2L-300x100","TU 250-100"]
[null,null,"T2L-750","K 750",null,"T2L-300x125","TU 250-125"]
[null,null,"T3-170","X 170",null,"NP-500x10","TU 500-10"]
[null,null,"T3-320","X 320",null,"NP-500x12.7","TU 500-12,7"]
[null,null,"T3-350","X 350",null,"NP-500x25","TU 500-25"]
[null,null,"T3-500","X 500",null,"NP-500x38.1","TU 500-38,1"]
[null,null,"T3-750","X 750",null,"NP-500x50","TU 500-50"]
[null,null,"T3-1000","X 1000",null,"NP-500x63.5","TU 500-63,5"]
[null,null,"T3-1500","X 1500",null,"NP-500x80","TU 500-80"]
[null,null,"T3-2400","X 2400",null,"NP-500x100","TU 500-100"]
[null,null,"T3-4200","X 4200",null,"NP-500x125","TU 500-125"]
[null,null,"T3-6600","X 6600",null,"NP-500x160","TU 500-160"]
[null,null,"T3-9500","X 9500",null,"NP-750x12.7","TU 750-12,7"]
[null,null,"T3-20000","X 20000",null,"NP-750x25","TU 750-25"]
[null,null,"T4-750","TX 750",null,"NP-750x38.1","TU 750-38,1"]
[null,null,"T4-1000","TX 1000",null,"NP-750x50","TU 750-50"]
[null,null,"T4-1500","TX 1500",null,"NP-750x63.5","TU 750-63,5"]
[null,null,"T4-2400","TX 2400",null,"NP-750x80","TU 750-80"]
[null,null,"T4-4200","TX 4200",null,"NP-750x100","TU 750-100"]
[null,null,"T4-6600","TX 6600",null,"NP-750x125","TU 750-125"]
[null,null,"T4-9500","TX 9500",null,"NP-750x160","TU 750-160"]
[null,null,"T4-20000","TX 20000",null,"NP-750x200","TU 750-200"]
[null,null,"NPL-750","TL 750",null,"NP-750x250","TU 750-250"]
[null,null,"NPL-1500","TL 1500",null,"NP-750x300","TU 750-300"]
[null,null,"NPL-3000","TL 3000",null,"NP-1500x25","TU 1500-25"]
[null,null,"NPL-5000","TL 5000",null,"NP-1500x38.1","TU 1500-38,1"]
[null,null,"NPL-7500","TL 7500",null,"NP-1500x50","TU 1500-50"]
[null,null,"T2-50","R12",null,"NP-1500x63.5","TU 1500-63,5"]
[null,null,"T2-70","R15",null,"NP-1500x80","TU 1500-80"]
[null,null,"T2-90","R19",null,"NP-1500x100","TU 1500-100"]
[null,null,"T2-180","M2",null,"NP-1500x125","TU 1500-125"]
[null,null,"T2-200","MC3",null,"NP-1500x160","TU 1500-160"]
[null,null,"T3T-350","XG 350",null,"NP-1500x200","TU 1500-200"]
[null,null,"T3T-500","XG 500",null,"NP-1500x250","TU 1500-250"]
[null,null,"T3T-750","XG 750",null,"NP-1500x300","TU 1500-300"]
[null,null,"T3T-1000","XG 1000",null,"NP-3000x25","TU 3000-25"]
[null,null,"T3T-1500","XG 1500",null,"NP-3000x38.1","TU 3000-38,1"]
[null,null,"T3T-2400","XG 2400",null,"NP-3000x50","TU 3000-50"]
[null,null,"T3T-4200","XG 4200",null,"NP-3000x63.5","TU 3000-63,5"]
[null,null,"T3T-6600","XG 6600",null,"NP-3000x80","TU 3000-80"]
[null,null,"T3T-9500","XG 9500",null,"NP-3000x100","TU 3000-100"]
[null,null,"T3F-750","XF 750",null,"NP-3000x125","TU 3000-125"]
[null,null,"T3F-1000","XF 1000",null,"NP-3000x160","TU 3000-160"]
[null,null,"T3F-1500","XF 1500",null,"NP-3000x200","TU 3000-200"]
[null,null,"T3F-2400","XF 2400",null,"NP-3000x250","TU 3000-250"]
[null,null,"T4SC-420","CU4 420",null,"NP-3000x300","TU 3000-300"]
[null,null,"T4SC-740","CU4 740",null,"NP-5000x25","TU 5000-25"]
[null,null,"T4SC-1000","CU4 1000",null,"NP-5000x38.1","TU 5000-38,1"]
[null,null,"T4SC-1800","CU4 1800",null,"NP-5000x50","TU 5000-50"]
[null,null,"T4SC-2900","CU4 2900",null,"NP-5000x63.5","TU 5000-63,5"]
[null,null,"T4SC-4700","CU4 4700",null,"NP-5000x80","TU 5000-80"]
[null,null,"T4SC-7500","CU4 7500",null,"NP-5000x100","TU 5000-100"]
[null,null,"T4SC-11800","CU4 11800",null,"NP-5000x125","TU 5000-125"]
[null,null,"T4SC-18300","CU4 18300",null,"NP-5000x160","TU 5000-160"]
[null,null,"T5-500","CX 500",null,"NP-5000x200","TU 5000-200"]
[null,null,"T5-1000","CX 1000",null,"NP-5000x250","TU 5000-250"]
[null,null,"T5-1900","CX 1900",null,"NP-5000x300","TU 5000-300"]
[null,null,"TNKB-1000","X 1000",null,"NP-7500x25","TU 7500-25"]
[null,null,"TNKB-2400","X 2400",null,"NP-7500x38.1","TU 7500-38,1"]
[null,null,"TNKB-2400","X 2400",null,"NP-7500x50","TU 7500-50"]
[null,null,"TNKB-4200","X 4200",null,"NP-7500x63.5","TU 7500-63,5"]
[null,null,"TNKB-6600","X 6600",null,"NP-7500x80","TU 7500-80"]
[null,null,"TNKT-1000","X 1000",null,"NP-7500x100","TU 7500-100"]
[null,null,"TNKT-2400","X 2400",null,"NP-7500x125","TU 7500-125"]
[null,null,"TNKT-4200","X 4200",null,"NP-7500x160","TU 7500-160"]
[null,null,"TNKT-6600","X 6600",null,"NP-7500x200","TU 7500-200"]
[null,null,"TNKS-1000","X 1000",null,"NP-7500x250","TU 7500-250"]
[null,null,"TNKS-2400","X 2400",null,"NP-7500x300","TU 7500-300"]
[null,null,"TNKS-4200","X 4200",null,"NP-10000x25","TU 10000-25"]
[null,null,"TNKS-6600","X 6600",null,"NP-10000x38.1","TU 10000-38,1"]
[null,null,"TNK-400","TU 500",null,"NP-10000x50","TU 10000-50"]
["Nya 20210902",null,"T2-750P","TL 750",null,"NP-10000x63.5","TU 10000-63,5"]
[null,null,"T2B-1500","TL 1500",null,"NP-10000x80","TU 10000-80"]
[null,null,"T2B-3000","TL 3000",null,"NP-10000x100","TU 10000-100"]
[null,null,"T2B-5000","TL 5000",null,"NP-10000x125","TU 10000-125"]
[null,null,null,null,null,"NP-10000x160","TU 10000-160"]
[null,null,null,null,null,"NP-10000x200","TU 10000-200"]
[null,null,null,null,null,"NP-10000x250","TU 10000-250"]
[null,null,null,null,null,"NP-10000x300","TU 10000-300"]
[null,null,null,null,null,"T2L-500x0.25","K 500-6"]
[null,null,null,null,null,"T2L-500x0.50","K 500-12,5"]
[null,null,null,null,null,"T2L-500x0.75","K 500-19"]
[null,null,null,null,null,"T2L-500x1.50","K 500-38,1"]
[null,null,null,null,null,"T2L-500x2.50","K 500-63,5"]
[null,null,null,null,null,"T2L-750x0.25","K 750-6"]
[null,null,null,null,null,"T2L-750x0.50","K 750-12,5"]
[null,null,null,null,null,"T2L-750x0.75","K 750-19"]
[null,null,null,null,null,"T2L-750x1.50","K 750-38,1"]
[null,null,null,null,null,"T2L-750x2.50","K 750-63,5"]
[null,null,null,null,null,"T3-170x7","X 170-7"]
[null,null,null,null,null,"T3-170x10","X 170-10"]
[null,null,null,null,null,"T3-170x15","X 170-15"]
[null,null,null,null,null,"T3-170x19","X 170-19"]
[null,null,null,null,null,"T3-170x25","X 170-25"]
[null,null,null,null,null,"T3-170x38","X 170-38"]
[null,null,null,null,null,"T3-170x50","X 170-50"]
[null,null,null,null,null,"T3-170x63","X 170-63"]
[null,null,null,null,null,"T3-170x75","X 170-75"]
[null,null,null,null,null,"T3-170x80","X 170-80"]
[null,null,null,null,null,"T3-170x100","X 170-100"]
[null,null,null,null,null,"T3-170x125","X 170-125"]
[null,null,null,null,null,"T3-320x7","X 320-7"]
[null,null,null,null,null,"T3-320x10","X 320-10"]
[null,null,null,null,null,"T3-320x15","X 320-15"]
[null,null,null,null,null,"T3-320x19","X 320-19"]
[null,null,null,null,null,"T3-320x25","X 320-25"]
[null,null,null,null,null,"T3-320x38","X 320-38"]
[null,null,null,null,null,"T3-320x50","X 320-50"]
[null,null,null,null,null,"T3-320x63","X 320-63"]
[null,null,null,null,null,"T3-320x75","X 320-75"]
[null,null,null,null,null,"T3-320x80","X 320-80"]
[null,null,null,null,null,"T3-320x100","X 320-100"]
[null,null,null,null,null,"T3-320x125","X 320-125"]
[null,null,null,null,null,"T3-350x10","X 350-10"]
[null,null,null,null,null,"T3-350x13","X 350-13"]
[null,null,null,null,null,"T3-350x16","X 350-16"]
[null,null,null,null,null,"T3-350x19","X 350-19"]
[null,null,null,null,null,"T3-350x25","X 350-25"]
[null,null,null,null,null,"T3-350x32","X 350-32"]
[null,null,null,null,null,"T3-350x38","X 350-38"]
[null,null,null,null,null,"T3-350x50","X 350-50"]
[null,null,null,null,null,"T3-350x63","X 350-63"]
[null,null,null,null,null,"T3-350x75","X 350-75"]
[null,null,null,null,null,"T3-350x80","X 350-80"]
[null,null,null,null,null,"T3-350x100","X 350-100"]
[null,null,null,null,null,"T3-350x125","X 350-125"]
[null,null,null,null,null,"T3-500x10","X 500-10"]
[null,null,null,null,null,"T3-500x13","X 500-13"]
[null,null,null,null,null,"T3-500x16","X 500-16"]
[null,null,null,null,null,"T3-500x19","X 500-19"]
[null,null,null,null,null,"T3-500x25","X 500-25"]
[null,null,null,null,null,"T3-500x32","X 500-32"]
[null,null,null,null,null,"T3-500x38","X 500-38"]
[null,null,null,null,null,"T3-500x50","X 500-50"]
[null,null,null,null,null,"T3-500x63","X 500-63"]
[null,null,null,null,null,"T3-500x75","X 500-75"]
[null,null,null,null,null,"T3-500x80","X 500-80"]
[null,null,null,null,null,"T3-500x100","X 500-100"]
[null,null,null,null,null,"T3-500x125","X 500-125"]
[null,null,null,null,null,"T3-750x10","X 750-10"]
[null,null,null,null,null,"T3-750x13","X 750-13"]
[null,null,null,null,null,"T3-750x16","X 750-16"]
[null,null,null,null,null,"T3-750x19","X 750-19"]
[null,null,null,null,null,"T3-750x25","X 750-25"]
[null,null,null,null,null,"T3-750x32","X 750-32"]
[null,null,null,null,null,"T3-750x38","X 750-38"]
[null,null,null,null,null,"T3-750x50","X 750-50"]
[null,null,null,null,null,"T3-750x63","X 750-63"]
[null,null,null,null,null,"T3-750x75","X 750-75"]
[null,null,null,null,null,"T3-750x80","X 750-80"]
[null,null,null,null,null,"T3-750x100","X 750-100"]
[null,null,null,null,null,"T3-750x125","X 750-125"]
[null,null,null,null,null,"T3-1000x13","X 1000-13"]
[null,null,null,null,null,"T3-1000x16","X 1000-16"]
[null,null,null,null,null,"T3-1000x19","X 1000-19"]
[null,null,null,null,null,"T3-1000x25","X 1000-25"]
[null,null,null,null,null,"T3-1000x32","X 1000-32"]
[null,null,null,null,null,"T3-1000x38","X 1000-38"]
[null,null,null,null,null,"T3-1000x50","X 1000-50"]
[null,null,null,null,null,"T3-1000x63","X 1000-63"]
[null,null,null,null,null,"T3-1000x75","X 1000-75"]
[null,null,null,null,null,"T3-1000x80","X 1000-80"]
[null,null,null,null,null,"T3-1000x100","X 1000-100"]
[null,null,null,null,null,"T3-1000x125","X 1000-125"]
[null,null,null,null,null,"T3-1500x13","X 1500-13"]
[null,null,null,null,null,"T3-1500x16","X 1500-16"]
[null,null,null,null,null,"T3-1500x19","X 1500-19"]
[null,null,null,null,null,"T3-1500x25","X 1500-25"]
[null,null,null,null,null,"T3-1500x32","X 1500-32"]
[null,null,null,null,null,"T3-1500x38","X 1500-38"]
[null,null,null,null,null,"T3-1500x50","X 1500-50"]
[null,null,null,null,null,"T3-1500x63","X 1500-63"]
[null,null,null,null,null,"T3-1500x75","X 1500-75"]
[null,null,null,null,null,"T3-1500x80","X 1500-80"]
[null,null,null,null,null,"T3-1500x100","X 1500-100"]
[null,null,null,null,null,"T3-1500x125","X 1500-125"]
[null,null,null,null,null,"T3-2400x16","X 2400-16"]
[null,null,null,null,null,"T3-2400x19","X 2400-19"]
[null,null,null,null,null,"T3-2400x25","X 2400-25"]
[null,null,null,null,null,"T3-2400x32","X 2400-32"]
[null,null,null,null,null,"T3-2400x38","X 2400-38"]
[null,null,null,null,null,"T3-2400x50","X 2400-50"]
[null,null,null,null,null,"T3-2400x63","X 2400-63"]
[null,null,null,null,null,"T3-2400x75","X 2400-75"]
[null,null,null,null,null,"T3-2400x80","X 2400-80"]
[null,null,null,null,null,"T3-2400x100","X 2400-100"]
[null,null,null,null,null,"T3-2400x125","X 2400-125"]
[null,null,null,null,null,"T3-4200x16","X 4200-16"]
[null,null,null,null,null,"T3-4200x19","X 4200-19"]
[null,null,null,null,null,"T3-4200x25","X 4200-25"]
[null,null,null,null,null,"T3-4200x32","X 4200-32"]
[null,null,null,null,null,"T3-4200x38","X 4200-38"]
[null,null,null,null,null,"T3-4200x50","X 4200-50"]
[null,null,null,null,null,"T3-4200x63","X 4200-63"]
[null,null,null,null,null,"T3-4200x75","X 4200-75"]
[null,null,null,null,null,"T3-4200x80","X 4200-80"]
[null,null,null,null,null,"T3-4200x100","X 4200-100"]
[null,null,null,null,null,"T3-4200x125","X 4200-125"]
[null,null,null,null,null,"T3-6600x16","X 6600-16"]
[null,null,null,null,null,"T3-6600x19","X 6600-19"]
[null,null,null,null,null,"T3-6600x25","X 6600-25"]
[null,null,null,null,null,"T3-6600x32","X 6600-32"]
[null,null,null,null,null,"T3-6600x38","X 6600-38"]
[null,null,null,null,null,"T3-6600x50","X 6600-50"]
[null,null,null,null,null,"T3-6600x63","X 6600-63"]
[null,null,null,null,null,"T3-6600x75","X 6600-75"]
[null,null,null,null,null,"T3-6600x80","X 6600-80"]
[null,null,null,null,null,"T3-6600x100","X 6600-100"]
[null,null,null,null,null,"T3-6600x125","X 6600-125"]
[null,null,null,null,null,"T3-9500x19","X 9500-19"]
[null,null,null,null,null,"T3-9500x25","X 9500-25"]
[null,null,null,null,null,"T3-9500x32","X 9500-32"]
[null,null,null,null,null,"T3-9500x38","X 9500-38"]
[null,null,null,null,null,"T3-9500x50","X 9500-50"]
[null,null,null,null,null,"T3-9500x63","X 9500-63"]
[null,null,null,null,null,"T3-9500x75","X 9500-75"]
[null,null,null,null,null,"T3-9500x80","X 9500-80"]
[null,null,null,null,null,"T3-9500x100","X 9500-100"]
[null,null,null,null,null,"T3-9500x125","X 9500-125"]
[null,null,null,null,null,"T3-20000x19","X 20000-19"]
[null,null,null,null,null,"T3-20000x25","X 20000-25"]
[null,null,null,null,null,"T3-20000x32","X 20000-32"]
[null,null,null,null,null,"T3-20000x38","X 20000-38"]
[null,null,null,null,null,"T3-20000x50","X 20000-50"]
[null,null,null,null,null,"T3-20000x63","X 20000-63"]
[null,null,null,null,null,"T3-20000x75","X 20000-75"]
[null,null,null,null,null,"T3-20000x80","X 20000-80"]
[null,null,null,null,null,"T3-20000x100","X 20000-100"]
[null,null,null,null,null,"T3-20000x125","X 20000-125"]
[null,null,null,null,null,"T4-750x12.7","TX 750-13"]
[null,null,null,null,null,"T4-750x25","TX 750-25"]
[null,null,null,null,null,"T4-750x38.1","TX 750-38"]
[null,null,null,null,null,"T4-750x50","TX 750-50"]
[null,null,null,null,null,"T4-750x63.5","TX 750-63"]
[null,null,null,null,null,"T4-750x75","TX 750-75"]
[null,null,null,null,null,"T4-750x80","TX 750-80"]
[null,null,null,null,null,"T4-750x100","TX 750-100"]
[null,null,null,null,null,"T4-750x125","TX 750-125"]
[null,null,null,null,null,"T4-750x150","TX 750-150"]
[null,null,null,null,null,"T4-750x160","TX 750-160"]
[null,null,null,null,null,"T4-750x175","TX 750-175"]
[null,null,null,null,null,"T4-750x200","TX 750-200"]
[null,null,null,null,null,"T4-1000x12.7","TX 1000-13"]
[null,null,null,null,null,"T4-1000x25","TX 1000-25"]
[null,null,null,null,null,"T4-1000x38.1","TX 1000-38"]
[null,null,null,null,null,"T4-1000x50","TX 1000-50"]
[null,null,null,null,null,"T4-1000x63.5","TX 1000-63"]
[null,null,null,null,null,"T4-1000x75","TX 1000-75"]
[null,null,null,null,null,"T4-1000x80","TX 1000-80"]
[null,null,null,null,null,"T4-1000x100","TX 1000-100"]
[null,null,null,null,null,"T4-1000x125","TX 1000-125"]
[null,null,null,null,null,"T4-1000x150","TX 1000-150"]
[null,null,null,null,null,"T4-1000x160","TX 1000-160"]
[null,null,null,null,null,"T4-1000x175","TX 1000-175"]
[null,null,null,null,null,"T4-1000x200","TX 1000-200"]
[null,null,null,null,null,"T4-1000x250","TX 1000-250"]
[null,null,null,null,null,"T4-1000x300","TX 1000-300"]
[null,null,null,null,null,"T4-1500x12.7","TX 1500-13"]
[null,null,null,null,null,"T4-1500x25","TX 1500-25"]
[null,null,null,null,null,"T4-1500x38.1","TX 1500-38"]
[null,null,null,null,null,"T4-1500x50","TX 1500-50"]
[null,null,null,null,null,"T4-1500x63.5","TX 1500-63"]
[null,null,null,null,null,"T4-1500x75","TX 1500-75"]
[null,null,null,null,null,"T4-1500x80","TX 1500-80"]
[null,null,null,null,null,"T4-1500x100","TX 1500-100"]
[null,null,null,null,null,"T4-1500x125","TX 1500-125"]
[null,null,null,null,null,"T4-1500x150","TX 1500-150"]
[null,null,null,null,null,"T4-1500x160","TX 1500-160"]
[null,null,null,null,null,"T4-1500x175","TX 1500-175"]
[null,null,null,null,null,"T4-1500x200","TX 1500-200"]
[null,null,null,null,null,"T4-1500x250","TX 1500-250"]
[null,null,null,null,null,"T4-1500x300","TX 1500-300"]
[null,null,null,null,null,"T4-2400x25","TX 2400-25"]
[null,null,null,null,null,"T4-2400x38.1","TX 2400-38"]
[null,null,null,null,null,"T4-2400x50","TX 2400-50"]
[null,null,null,null,null,"T4-2400x63.5","TX 2400-63"]
[null,null,null,null,null,"T4-2400x75","TX 2400-75"]
[null,null,null,null,null,"T4-2400x80","TX 2400-80"]
[null,null,null,null,null,"T4-2400x100","TX 2400-100"]
[null,null,null,null,null,"T4-2400x125","TX 2400-125"]
[null,null,null,null,null,"T4-2400x150","TX 2400-150"]
[null,null,null,null,null,"T4-2400x160","TX 2400-160"]
[null,null,null,null,null,"T4-2400x175","TX 2400-175"]
[null,null,null,null,null,"T4-2400x200","TX 2400-200"]
[null,null,null,null,null,"T4-2400x250","TX 2400-250"]
[null,null,null,null,null,"T4-2400x300","TX 2400-300"]
[null,null,null,null,null,"T4-4200x25","TX 4200-25"]
[null,null,null,null,null,"T4-4200x38.1","TX 4200-38"]
[null,null,null,null,null,"T4-4200x50","TX 4200-50"]
[null,null,null,null,null,"T4-4200x63.5","TX 4200-63"]
[null,null,null,null,null,"T4-4200x75","TX 4200-75"]
[null,null,null,null,null,"T4-4200x80","TX 4200-80"]
[null,null,null,null,null,"T4-4200x100","TX 4200-100"]
[null,null,null,null,null,"T4-4200x125","TX 4200-125"]
[null,null,null,null,null,"T4-4200x150","TX 4200-150"]
[null,null,null,null,null,"T4-4200x160","TX 4200-160"]
[null,null,null,null,null,"T4-4200x175","TX 4200-175"]
[null,null,null,null,null,"T4-4200x200","TX 4200-200"]
[null,null,null,null,null,"T4-4200x250","TX 4200-250"]
[null,null,null,null,null,"T4-4200x300","TX 4200-300"]
[null,null,null,null,null,"T4-6600x25","TX 6600-25"]
[null,null,null,null,null,"T4-6600x38.1","TX 6600-38"]
[null,null,null,null,null,"T4-6600x50","TX 6600-50"]
[null,null,null,null,null,"T4-6600x63.5","TX 6600-63"]
[null,null,null,null,null,"T4-6600x75","TX 6600-75"]
[null,null,null,null,null,"T4-6600x80","TX 6600-80"]
[null,null,null,null,null,"T4-6600x100","TX 6600-100"]
[null,null,null,null,null,"T4-6600x125","TX 6600-125"]
[null,null,null,null,null,"T4-6600x150","TX 6600-150"]
[null,null,null,null,null,"T4-6600x160","TX 6600-160"]
[null,null,null,null,null,"T4-6600x175","TX 6600-175"]
[null,null,null,null,null,"T4-6600x200","TX 6600-200"]
[null,null,null,null,null,"T4-6600x250","TX 6600-250"]
[null,null,null,null,null,"T4-6600x300","TX 6600-300"]
[null,null,null,null,null,"T4-9500x25","TX 9500-25"]
[null,null,null,null,null,"T4-9500x38.1","TX 9500-38"]
[null,null,null,null,null,"T4-9500x50","TX 9500-50"]
[null,null,null,null,null,"T4-9500x63.5","TX 9500-63"]
[null,null,null,null,null,"T4-9500x75","TX 9500-75"]
[null,null,null,null,null,"T4-9500x80","TX 9500-80"]
[null,null,null,null,null,"T4-9500x100","TX 9500-100"]
[null,null,null,null,null,"T4-9500x125","TX 9500-125"]
[null,null,null,null,null,"T4-9500x150","TX 9500-150"]
[null,null,null,null,null,"T4-9500x160","TX 9500-160"]
[null,null,null,null,null,"T4-9500x175","TX 9500-175"]
[null,null,null,null,null,"T4-9500x200","TX 9500-200"]
[null,null,null,null,null,"T4-9500x250","TX 9500-250"]
[null,null,null,null,null,"T4-9500x300","TX 9500-300"]
[null,null,null,null,null,"T4-20000x25","TX 20000-25"]
[null,null,null,null,null,"T4-20000x38.1","TX 20000-38"]
[null,null,null,null,null,"T4-20000x50","TX 20000-50"]
[null,null,null,null,null,"T4-20000x63.5","TX 20000-63"]
[null,null,null,null,null,"T4-20000x80","TX 20000-80"]
[null,null,null,null,null,"T4-20000x100","TX 20000-100"]
[null,null,null,null,null,"T4-20000x125","TX 20000-125"]
[null,null,null,null,null,"T4-20000x160","TX 20000-160"]
[null,null,null,null,null,"T4-20000x200","TX 20000-200"]
[null,null,null,null,null,"T4-20000x250","TX 20000-250"]
[null,null,null,null,null,"T4-20000x300","TX 20000-300"]
[null,null,null,null,null,"NPL-750x12.5","TL 750-12,5"]
[null,null,null,null,null,"NPL-750x25","TL 750-25"]
[null,null,null,null,null,"NPL-750x37.5","TL 750-37,5"]
[null,null,null,null,null,"NPL-750x50","TL 750-50"]
[null,null,null,null,null,"NPL-750x62.5","TL 750-62,5"]
[null,null,null,null,null,"NPL-750x75","TL 750-75"]
[null,null,null,null,null,"NPL-750x80","TL 750-80"]
[null,null,null,null,null,"NPL-750x87.5","TL 750-87,5"]
[null,null,null,null,null,"NPL-750x100","TL 750-100"]
[null,null,null,null,null,"NPL-750x112.5","TL 750-112,5"]
[null,null,null,null,null,"NPL-750x125","TL 750-125"]
[null,null,null,null,null,"NPL-750x137.5","TL 750-137,5"]
[null,null,null,null,null,"NPL-750x150","TL 750-150"]
[null,null,null,null,null,"NPL-750x160","TL 750-160"]
[null,null,null,null,null,"NPL-750x175","TL 750-175"]
[null,null,null,null,null,"NPL-750x200","TL 750-200"]
[null,null,null,null,null,"NPL-750x225","TL 750-225"]
[null,null,null,null,null,"NPL-750x250","TL 750-250"]
[null,null,null,null,null,"NPL-1500x12.5","TL 1500-12,5"]
[null,null,null,null,null,"NPL-1500x25","TL 1500-25"]
[null,null,null,null,null,"NPL-1500x37.5","TL 1500-37,5"]
[null,null,null,null,null,"NPL-1500x50","TL 1500-50"]
[null,null,null,null,null,"NPL-1500x62.5","TL 1500-62,5"]
[null,null,null,null,null,"NPL-1500x75","TL 1500-75"]
[null,null,null,null,null,"NPL-1500x80","TL 1500-80"]
[null,null,null,null,null,"NPL-1500x87.5","TL 1500-87,5"]
[null,null,null,null,null,"NPL-1500x100","TL 1500-100"]
[null,null,null,null,null,"NPL-1500x112.5","TL 1500-112,5"]
[null,null,null,null,null,"NPL-1500x125","TL 1500-125"]
[null,null,null,null,null,"NPL-1500x137.5","TL 1500-137,5"]
[null,null,null,null,null,"NPL-1500x150","TL 1500-150"]
[null,null,null,null,null,"NPL-1500x160","TL 1500-160"]
[null,null,null,null,null,"NPL-1500x175","TL 1500-175"]
[null,null,null,null,null,"NPL-1500x200","TL 1500-200"]
[null,null,null,null,null,"NPL-1500x225","TL 1500-225"]
[null,null,null,null,null,"NPL-1500x250","TL 1500-250"]
[null,null,null,null,null,"NPL-3000x12.5","TL 3000-12,5"]
[null,null,null,null,null,"NPL-3000x25","TL 3000-25"]
[null,null,null,null,null,"NPL-3000x37.5","TL 3000-37,5"]
[null,null,null,null,null,"NPL-3000x50","TL 3000-50"]
[null,null,null,null,null,"NPL-3000x62.5","TL 3000-62,5"]
[null,null,null,null,null,"NPL-3000x75","TL 3000-75"]
[null,null,null,null,null,"NPL-3000x80","TL 3000-80"]
[null,null,null,null,null,"NPL-3000x87.5","TL 3000-87,5"]
[null,null,null,null,null,"NPL-3000x100","TL 3000-100"]
[null,null,null,null,null,"NPL-3000x112.5","TL 3000-112,5"]
[null,null,null,null,null,"NPL-3000x125","TL 3000-125"]
[null,null,null,null,null,"NPL-3000x137.5","TL 3000-137,5"]
[null,null,null,null,null,"NPL-3000x150","TL 3000-150"]
[null,null,null,null,null,"NPL-3000x160","TL 3000-160"]
[null,null,null,null,null,"NPL-3000x175","TL 3000-175"]
[null,null,null,null,null,"NPL-3000x200","TL 3000-200"]
[null,null,null,null,null,"NPL-3000x225","TL 3000-225"]
[null,null,null,null,null,"NPL-3000x250","TL 3000-250"]
[null,null,null,null,null,"NPL-5000x25","TL 5000-25"]
[null,null,null,null,null,"NPL-5000x37.5","TL 5000-37,5"]
[null,null,null,null,null,"NPL-5000x50","TL 5000-50"]
[null,null,null,null,null,"NPL-5000x62.5","TL 5000-62,5"]
[null,null,null,null,null,"NPL-5000x75","TL 5000-75"]
[null,null,null,null,null,"NPL-5000x80","TL 5000-80"]
[null,null,null,null,null,"NPL-5000x87.5","TL 5000-87,5"]
[null,null,null,null,null,"NPL-5000x100","TL 5000-100"]
[null,null,null,null,null,"NPL-5000x112.5","TL 5000-112,5"]
[null,null,null,null,null,"NPL-5000x125","TL 5000-125"]
[null,null,null,null,null,"NPL-5000x137.5","TL 5000-137,5"]
[null,null,null,null,null,"NPL-5000x150","TL 5000-150"]
[null,null,null,null,null,"NPL-5000x160","TL 5000-160"]
[null,null,null,null,null,"NPL-5000x175","TL 5000-175"]
[null,null,null,null,null,"NPL-5000x200","TL 5000-200"]
[null,null,null,null,null,"NPL-5000x225","TL 5000-225"]
[null,null,null,null,null,"NPL-5000x250","TL 5000-250"]
[null,null,null,null,null,"NPL-7500x25","TL 7500-25"]
[null,null,null,null,null,"NPL-7500x37.5","TL 7500-37,5"]
[null,null,null,null,null,"NPL-7500x50","TL 7500-50"]
[null,null,null,null,null,"NPL-7500x62.5","TL 7500-62,5"]
[null,null,null,null,null,"NPL-7500x75","TL 7500-75"]
[null,null,null,null,null,"NPL-7500x80","TL 7500-80"]
[null,null,null,null,null,"NPL-7500x87.5","TL 7500-87,5"]
[null,null,null,null,null,"NPL-7500x100","TL 7500-100"]
[null,null,null,null,null,"NPL-7500x112.5","TL 7500-112,5"]
[null,null,null,null,null,"NPL-7500x125","TL 7500-125"]
[null,null,null,null,null,"NPL-7500x137.5","TL 7500-137,5"]
[null,null,null,null,null,"NPL-7500x150","TL 7500-150"]
[null,null,null,null,null,"NPL-7500x160","TL 7500-160"]
[null,null,null,null,null,"NPL-7500x175","TL 7500-175"]
[null,null,null,null,null,"NPL-7500x200","TL 7500-200"]
[null,null,null,null,null,"NPL-7500x225","TL 7500-225"]
[null,null,null,null,null,"NPL-7500x250","TL 7500-250"]
[null,null,null,null,null,"T2-50x7","R12-7"]
[null,null,null,null,null,"T2-50x10","R12-10"]
[null,null,null,null,null,"T2-50x12.7","R12-12,7"]
[null,null,null,null,null,"T2-50x15","R12-15"]
[null,null,null,null,null,"T2-50x19","R12-19"]
[null,null,null,null,null,"T2-50x25","R12-25"]
[null,null,null,null,null,"T2-50x38","R12-38,1"]
[null,null,null,null,null,"T2-50x50","R12-50"]
[null,null,null,null,null,"T2-50x63","R12-63,5"]
[null,null,null,null,null,"T2-50x75","R12-75"]
[null,null,null,null,null,"T2-50x80","R12-80"]
[null,null,null,null,null,"T2-50x100","R12-100"]
[null,null,null,null,null,"T2-50x125","R12-125"]
[null,null,null,null,null,"T2-70x7","R15-7"]
[null,null,null,null,null,"T2-70x10","R15-10"]
[null,null,null,null,null,"T2-70x12.7","R15-12,7"]
[null,null,null,null,null,"T2-70x15","R15-15"]
[null,null,null,null,null,"T2-70x19","R15-19"]
[null,null,null,null,null,"T2-70x25","R15-25"]
[null,null,null,null,null,"T2-70x38","R15-38,1"]
[null,null,null,null,null,"T2-70x50","R15-50"]
[null,null,null,null,null,"T2-70x63","R15-63,5"]
[null,null,null,null,null,"T2-70x75","R15-75"]
[null,null,null,null,null,"T2-70x80","R15-80"]
[null,null,null,null,null,"T2-70x100","R15-100"]
[null,null,null,null,null,"T2-70x125","R15-125"]
[null,null,null,null,null,"T2-90x7","R19-7"]
[null,null,null,null,null,"T2-90x10","R19-10"]
[null,null,null,null,null,"T2-90x15","R19-15"]
[null,null,null,null,null,"T2-90x25","R19-25"]
[null,null,null,null,null,"T2-90x38.1","R19-38,1"]
[null,null,null,null,null,"T2-90x50","R19-50"]
[null,null,null,null,null,"T2-90x63.5","R19-63,5"]
[null,null,null,null,null,"T2-90x80","R19-80"]
[null,null,null,null,null,"T2-90x100","R19-100"]
[null,null,null,null,null,"T2-90x125","R19-125"]
[null,null,null,null,null,"T2-180x10","M2-10"]
[null,null,null,null,null,"T2-180x12.7","M2-12,7"]
[null,null,null,null,null,"T2-180x15","M2-15"]
[null,null,null,null,null,"T2-180x16","M2-16"]
[null,null,null,null,null,"T2-180x25","M2-25"]
[null,null,null,null,null,"T2-180x38.1","M2-38,1"]
[null,null,null,null,null,"T2-180x50","M2-50"]
[null,null,null,null,null,"T2-180x63.5","M2-63,5"]
[null,null,null,null,null,"T2-180x80","M2-80"]
[null,null,null,null,null,"T2-180x100","M2-100"]
[null,null,null,null,null,"T2-180x125","M2-125"]
[null,null,null,null,null,"T2-200x10","MC3-10"]
[null,null,null,null,null,"T2-200x12.7","MC3-12,7"]
[null,null,null,null,null,"T2-200x16","MC3-16"]
[null,null,null,null,null,"T2-200x25","MC3-25"]
[null,null,null,null,null,"T2-200x38.1","MC3-38,1"]
[null,null,null,null,null,"T2-200x50","MC3-50"]
[null,null,null,null,null,"T2-200x63.5","MC3-63,5"]
[null,null,null,null,null,"T2-200x80","MC3-80"]
[null,null,null,null,null,"T2-200x100","MC3-100"]
[null,null,null,null,null,"T2-200x125","MC3-125"]
[null,null,null,null,null,"T3T-350x10","XG 350-10"]
[null,null,null,null,null,"T3T-350x13","XG 350-13"]
[null,null,null,null,null,"T3T-350x16","XG 350-16"]
[null,null,null,null,null,"T3T-350x19","XG 350-19"]
[null,null,null,null,null,"T3T-350x25","XG 350-25"]
[null,null,null,null,null,"T3T-350x32","XG 350-32"]
[null,null,null,null,null,"T3T-350x38","XG 350-38"]
[null,null,null,null,null,"T3T-350x50","XG 350-50"]
[null,null,null,null,null,"T3T-350x63","XG 350-63"]
[null,null,null,null,null,"T3T-350x75","XG 350-75"]
[null,null,null,null,null,"T3T-350x80","XG 350-80"]
[null,null,null,null,null,"T3T-350x100","XG 350-100"]
[null,null,null,null,null,"T3T-350x125","XG 350-125"]
[null,null,null,null,null,"T3T-500x10","XG 500-10"]
[null,null,null,null,null,"T3T-500x13","XG 500-13"]
[null,null,null,null,null,"T3T-500x16","XG 500-16"]
[null,null,null,null,null,"T3T-500x19","XG 500-19"]
[null,null,null,null,null,"T3T-500x25","XG 500-25"]
[null,null,null,null,null,"T3T-500x32","XG 500-32"]
[null,null,null,null,null,"T3T-500x38","XG 500-38"]
[null,null,null,null,null,"T3T-500x50","XG 500-50"]
[null,null,null,null,null,"T3T-500x63","XG 500-63"]
[null,null,null,null,null,"T3T-500x75","XG 500-75"]
[null,null,null,null,null,"T3T-500x80","XG 500-80"]
[null,null,null,null,null,"T3T-500x100","XG 500-100"]
[null,null,null,null,null,"T3T-500x125","XG 500-125"]
[null,null,null,null,null,"T3T-750x10","XG 750-10"]
[null,null,null,null,null,"T3T-750x13","XG 750-13"]
[null,null,null,null,null,"T3T-750x16","XG 750-16"]
[null,null,null,null,null,"T3T-750x19","XG 750-19"]
[null,null,null,null,null,"T3T-750x25","XG 750-25"]
[null,null,null,null,null,"T3T-750x32","XG 750-32"]
[null,null,null,null,null,"T3T-750x38","XG 750-38"]
[null,null,null,null,null,"T3T-750x50","XG 750-50"]
[null,null,null,null,null,"T3T-750x63","XG 750-63"]
[null,null,null,null,null,"T3T-750x75","XG 750-75"]
[null,null,null,null,null,"T3T-750x80","XG 750-80"]
[null,null,null,null,null,"T3T-750x100","XG 750-100"]
[null,null,null,null,null,"T3T-750x125","XG 750-125"]
[null,null,null,null,null,"T3T-1000x13","XG 1000-13"]
[null,null,null,null,null,"T3T-1000x16","XG 1000-16"]
[null,null,null,null,null,"T3T-1000x19","XG 1000-19"]
[null,null,null,null,null,"T3T-1000x25","XG 1000-25"]
[null,null,null,null,null,"T3T-1000x32","XG 1000-32"]
[null,null,null,null,null,"T3T-1000x38","XG 1000-38"]
[null,null,null,null,null,"T3T-1000x50","XG 1000-50"]
[null,null,null,null,null,"T3T-1000x63","XG 1000-63"]
[null,null,null,null,null,"T3T-1000x75","XG 1000-75"]
[null,null,null,null,null,"T3T-1000x80","XG 1000-80"]
[null,null,null,null,null,"T3T-1000x100","XG 1000-100"]
[null,null,null,null,null,"T3T-1000x125","XG 1000-125"]
[null,null,null,null,null,"T3T-1500x13","XG 1500-13"]
[null,null,null,null,null,"T3T-1500x16","XG 1500-16"]
[null,null,null,null,null,"T3T-1500x19","XG 1500-19"]
[null,null,null,null,null,"T3T-1500x25","XG 1500-25"]
[null,null,null,null,null,"T3T-1500x32","XG 1500-32"]
[null,null,null,null,null,"T3T-1500x38","XG 1500-38"]
[null,null,null,null,null,"T3T-1500x50","XG 1500-50"]
[null,null,null,null,null,"T3T-1500x63","XG 1500-63"]
[null,null,null,null,null,"T3T-1500x75","XG 1500-75"]
[null,null,null,null,null,"T3T-1500x80","XG 1500-80"]
[null,null,null,null,null,"T3T-1500x100","XG 1500-100"]
[null,null,null,null,null,"T3T-1500x125","XG 1500-125"]
[null,null,null,null,null,"T3T-2400x16","XG 2400-16"]
[null,null,null,null,null,"T3T-2400x19","XG 2400-19"]
[null,null,null,null,null,"T3T-2400x25","XG 2400-25"]
[null,null,null,null,null,"T3T-2400x32","XG 2400-32"]
[null,null,null,null,null,"T3T-2400x38","XG 2400-38"]
[null,null,null,null,null,"T3T-2400x50","XG 2400-50"]
[null,null,null,null,null,"T3T-2400x63","XG 2400-63"]
[null,null,null,null,null,"T3T-2400x75","XG 2400-75"]
[null,null,null,null,null,"T3T-2400x80","XG 2400-80"]
[null,null,null,null,null,"T3T-2400x100","XG 2400-100"]
[null,null,null,null,null,"T3T-2400x125","XG 2400-125"]
[null,null,null,null,null,"T3T-4200x16","XG 4200-16"]
[null,null,null,null,null,"T3T-4200x19","XG 4200-19"]
[null,null,null,null,null,"T3T-4200x25","XG 4200-25"]
[null,null,null,null,null,"T3T-4200x32","XG 4200-32"]
[null,null,null,null,null,"T3T-4200x38","XG 4200-38"]
[null,null,null,null,null,"T3T-4200x50","XG 4200-50"]
[null,null,null,null,null,"T3T-4200x63","XG 4200-63"]
[null,null,null,null,null,"T3T-4200x75","XG 4200-75"]
[null,null,null,null,null,"T3T-4200x80","XG 4200-80"]
[null,null,null,null,null,"T3T-4200x100","XG 4200-100"]
[null,null,null,null,null,"T3T-4200x125","XG 4200-125"]
[null,null,null,null,null,"T3T-6600x16","XG 6600-16"]
[null,null,null,null,null,"T3T-6600x19","XG 6600-19"]
[null,null,null,null,null,"T3T-6600x25","XG 6600-25"]
[null,null,null,null,null,"T3T-6600x32","XG 6600-32"]
[null,null,null,null,null,"T3T-6600x38","XG 6600-38"]
[null,null,null,null,null,"T3T-6600x50","XG 6600-50"]
[null,null,null,null,null,"T3T-6600x63","XG 6600-63"]
[null,null,null,null,null,"T3T-6600x75","XG 6600-75"]
[null,null,null,null,null,"T3T-6600x80","XG 6600-80"]
[null,null,null,null,null,"T3T-6600x100","XG 6600-100"]
[null,null,null,null,null,"T3T-6600x125","XG 6600-125"]
[null,null,null,null,"Finns ej i tempbladet","T3T-9500x19","XG 9500-19"]
[null,null,null,null,null,"T3T-9500x25","XG 9500-25"]
[null,null,null,null,null,"T3T-9500x32","XG 9500-32"]
[null,null,null,null,null,"T3T-9500x38","XG 9500-38"]
[null,null,null,null,null,"T3T-9500x50","XG 9500-50"]
[null,null,null,null,null,"T3T-9500x63","XG 9500-63"]
[null,null,null,null,null,"T3T-9500x75","XG 9500-75"]
[null,null,null,null,null,"T3T-9500x80","XG 9500-80"]
[null,null,null,null,null,"T3T-9500x100","XG 9500-100"]
[null,null,null,null,null,"T3T-9500x125","XG 9500-125"]
[null,null,null,null,null,"T3F-750x10","XF 750-10"]
[null,null,null,null,null,"T3F-750x13","XF 750-13"]
[null,null,null,null,null,"T3F-750x16","XF 750-16"]
[null,null,null,null,null,"T3F-750x19","XF 750-19"]
[null,null,null,null,null,"T3F-750x25","XF 750-25"]
[null,null,null,null,null,"T3F-750x32","XF 750-32"]
[null,null,null,null,null,"T3F-750x38","XF 750-38"]
[null,null,null,null,null,"T3F-750x50","XF 750-50"]
[null,null,null,null,null,"T3F-750x63","XF 750-63"]
[null,null,null,null,null,"T3F-750x75","XF 750-75"]
[null,null,null,null,null,"T3F-750x80","XF 750-80"]
[null,null,null,null,null,"T3F-750x100","XF 750-100"]
[null,null,null,null,null,"T3F-750x125","XF 750-125"]
[null,null,null,null,null,"T3F-1000x13","XF 1000-13"]
[null,null,null,null,null,"T3F-1000x16","XF 1000-16"]
[null,null,null,null,null,"T3F-1000x19","XF 1000-19"]
[null,null,null,null,null,"T3F-1000x25","XF 1000-25"]
[null,null,null,null,null,"T3F-1000x32","XF 1000-32"]
[null,null,null,null,null,"T3F-1000x38","XF 1000-38"]
[null,null,null,null,null,"T3F-1000x50","XF 1000-50"]
[null,null,null,null,null,"T3F-1000x63","XF 1000-63"]
[null,null,null,null,null,"T3F-1000x75","XF 1000-75"]
[null,null,null,null,null,"T3F-1000x80","XF 1000-80"]
[null,null,null,null,null,"T3F-1000x100","XF 1000-100"]
[null,null,null,null,null,"T3F-1000x125","XF 1000-125"]
[null,null,null,null,null,"T3F-1500x13","XF 1500-13"]
[null,null,null,null,null,"T3F-1500x16","XF 1500-16"]
[null,null,null,null,null,"T3F-1500x19","XF 1500-19"]
[null,null,null,null,null,"T3F-1500x25","XF 1500-25"]
[null,null,null,null,null,"T3F-1500x32","XF 1500-32"]
[null,null,null,null,null,"T3F-1500x38","XF 1500-38"]
[null,null,null,null,null,"T3F-1500x50","XF 1500-50"]
[null,null,null,null,null,"T3F-1500x63","XF 1500-63"]
[null,null,null,null,null,"T3F-1500x75","XF 1500-75"]
[null,null,null,null,null,"T3F-1500x80","XF 1500-80"]
[null,null,null,null,null,"T3F-1500x100","XF 1500-100"]
[null,null,null,null,null,"T3F-1500x125","XF 1500-125"]
[null,null,null,null,null,"T3F-2400x16","XF 2400-16"]
[null,null,null,null,null,"T3F-2400x19","XF 2400-19"]
[null,null,null,null,null,"T3F-2400x25","XF 2400-25"]
[null,null,null,null,null,"T3F-2400x32","XF 2400-32"]
[null,null,null,null,null,"T3F-2400x38","XF 2400-38"]
[null,null,null,null,null,"T3F-2400x50","XF 2400-50"]
[null,null,null,null,null,"T3F-2400x63","XF 2400-63"]
[null,null,null,null,null,"T3F-2400x75","XF 2400-75"]
[null,null,null,null,null,"T3F-2400x80","XF 2400-80"]
[null,null,null,null,null,"T3F-2400x100","XF 2400-100"]
[null,null,null,null,null,"T3F-2400x125","XF 2400-125"]
[null,null,null,null,null,"T4SC-420x6","CU4 420-6"]
[null,null,null,null,null,"T4SC-420x10","CU4 420-10"]
[null,null,null,null,null,"T4SC-420x16","CU4 420-16"]
[null,null,null,null,null,"T4SC-420x25","CU4 420-25"]
[null,null,null,null,null,"T4SC-420x32","CU4 420-32"]
[null,null,null,null,null,"T4SC-420x40","CU4 420-40"]
[null,null,null,null,null,"T4SC-420x50","CU4 420-50"]
[null,null,null,null,null,"T4SC-740x6","CU4 740-6"]
[null,null,null,null,null,"T4SC-740x10","CU4 740-10"]
[null,null,null,null,null,"T4SC-740x16","CU4 740-16"]
[null,null,null,null,null,"T4SC-740x25","CU4 740-25"]
[null,null,null,null,null,"T4SC-740x32","CU4 740-32"]
[null,null,null,null,null,"T4SC-740x40","CU4 740-40"]
[null,null,null,null,null,"T4SC-740x50","CU4 740-50"]
[null,null,null,null,null,"T4SC-1000x6","CU4 1000-6"]
[null,null,null,null,null,"T4SC-1000x10","CU4 1000-10"]
[null,null,null,null,null,"T4SC-1000x16","CU4 1000-16"]
[null,null,null,null,null,"T4SC-1000x25","CU4 1000-25"]
[null,null,null,null,null,"T4SC-1000x32","CU4 1000-32"]
[null,null,null,null,null,"T4SC-1000x40","CU4 1000-40"]
[null,null,null,null,null,"T4SC-1000x50","CU4 1000-50"]
[null,null,null,null,null,"T4SC-1800x6","CU4 1800-6"]
[null,null,null,null,null,"T4SC-1800x10","CU4 1800-10"]
[null,null,null,null,null,"T4SC-1800x16","CU4 1800-16"]
[null,null,null,null,null,"T4SC-1800x25","CU4 1800-25"]
[null,null,null,null,null,"T4SC-1800x32","CU4 1800-32"]
[null,null,null,null,null,"T4SC-1800x40","CU4 1800-40"]
[null,null,null,null,null,"T4SC-1800x50","CU4 1800-50"]
[null,null,null,null,null,"T4SC-1800x65","CU4 1800-65"]
[null,null,null,null,null,"T4SC-2900x10","CU4 2900-10"]
[null,null,null,null,null,"T4SC-2900x16","CU4 2900-16"]
[null,null,null,null,null,"T4SC-2900x25","CU4 2900-25"]
[null,null,null,null,null,"T4SC-2900x32","CU4 2900-32"]
[null,null,null,null,null,"T4SC-2900x40","CU4 2900-40"]
[null,null,null,null,null,"T4SC-2900x50","CU4 2900-50"]
[null,null,null,null,null,"T4SC-2900x65","CU4 2900-65"]
[null,null,null,null,null,"T4SC-4700x10","CU4 4700-10"]
[null,null,null,null,null,"T4SC-4700x16","CU4 4700-16"]
[null,null,null,null,null,"T4SC-4700x25","CU4 4700-25"]
[null,null,null,null,null,"T4SC-4700x32","CU4 4700-32"]
[null,null,null,null,null,"T4SC-4700x40","CU4 4700-40"]
[null,null,null,null,null,"T4SC-4700x50","CU4 4700-50"]
[null,null,null,null,null,"T4SC-4700x65","CU4 4700-65"]
[null,null,null,null,null,"T4SC-7500x10","CU4 7500-10"]
[null,null,null,null,null,"T4SC-7500x16","CU4 7500-16"]
[null,null,null,null,null,"T4SC-7500x25","CU4 7500-25"]
[null,null,null,null,null,"T4SC-7500x32","CU4 7500-32"]
[null,null,null,null,null,"T4SC-7500x40","CU4 7500-40"]
[null,null,null,null,null,"T4SC-7500x50","CU4 7500-50"]
[null,null,null,null,null,"T4SC-7500x65","CU4 7500-65"]
[null,null,null,null,null,"T4SC-11800x10","CU4 11800-10"]
[null,null,null,null,null,"T4SC-11800x16","CU4 11800-16"]
[null,null,null,null,null,"T4SC-11800x25","CU4 11800-25"]
[null,null,null,null,null,"T4SC-11800x32","CU4 11800-32"]
[null,null,null,null,null,"T4SC-11800x40","CU4 11800-40"]
[null,null,null,null,null,"T4SC-11800x50","CU4 11800-50"]
[null,null,null,null,null,"T4SC-11800x65","CU4 11800-65"]
[null,null,null,null,null,"T4SC-18300x10","CU4 18300-10"]
[null,null,null,null,null,"T4SC-18300x16","CU4 18300-16"]
[null,null,null,null,null,"T4SC-18300x25","CU4 18300-25"]
[null,null,null,null,null,"T4SC-18300x32","CU4 18300-32"]
[null,null,null,null,null,"T4SC-18300x40","CU4 18300-40"]
[null,null,null,null,null,"T4SC-18300x50","CU4 18300-50"]
[null,null,null,null,null,"T4SC-18300x65","CU4 18300-65"]
[null,null,null,null,null,"T5-500x10","CX 500-10"]
[null,null,null,null,null,"T5-500x15","CX 500-15"]
[null,null,null,null,null,"T5-500x25","CX 500-25"]
[null,null,null,null,null,"T5-500x38","CX 500-38"]
[null,null,null,null,null,"T5-500x50","CX 500-50"]
[null,null,null,null,null,"T5-500x63","CX 500-63"]
[null,null,null,null,null,"T5-500x80","CX 500-80"]
[null,null,null,null,null,"T5-1000x10","CX 1000-10"]
[null,null,null,null,null,"T5-1000x15","CX 1000-15"]
[null,null,null,null,null,"T5-1000x25","CX 1000-25"]
[null,null,null,null,null,"T5-1000x38","CX 1000-38"]
[null,null,null,null,null,"T5-1000x50","CX 1000-50"]
[null,null,null,null,null,"T5-1000x63","CX 1000-63"]
[null,null,null,null,null,"T5-1000x80","CX 1000-80"]
[null,null,null,null,null,"T5-1900x10","CX 1900-10"]
[null,null,null,null,null,"T5-1900x15","CX 1900-15"]
[null,null,null,null,null,"T5-1900x25","CX 1900-25"]
[null,null,null,null,null,"T5-1900x38","CX 1900-38"]
[null,null,null,null,null,"T5-1900x50","CX 1900-50"]
[null,null,null,null,null,"T5-1900x63","CX 1900-63"]
[null,null,null,null,null,"T5-1900x80","CX 1900-80"]
[null,null,null,null,"Temperature references","TNKB-1000x16","X 1000-16"]
[null,null,null,null,null,"TNKB-1000x25","X 1000-25"]
[null,null,null,null,null,"TNKB-1000x38","X 1000-38"]
[null,null,null,null,null,"TNKB-1000x50","X 1000-50"]
[null,null,null,null,null,"TNKB-1000x63","X 1000-63"]
[null,null,null,null,null,"TNKB-1000x75","X 1000-75"]
[null,null,null,null,null,"TNKB-1000x88","X 1000-88"]
[null,null,null,null,null,"TNKB-1000x100","X 1000-100"]
[null,null,null,null,null,"TNKB-1000x113","X 1000-113"]
[null,null,null,null,null,"TNKB-1000x125","X 1000-125"]
[null,null,null,null,null,"TNKB-1000x138","X 1000-138"]
[null,null,null,null,null,"TNKB-1000x150","X 1000-150"]
[null,null,null,null,null,"TNKB-2400x16","X 2400-16"]
[null,null,null,null,null,"TNKB-2400x25","X 2400-25"]
[null,null,null,null,null,"TNKB-2400x38","X 2400-38"]
[null,null,null,null,null,"TNKB-2400x50","X 2400-50"]
[null,null,null,null,null,"TNKB-2400x63","X 2400-63"]
[null,null,null,null,null,"TNKB-2400x75","X 2400-75"]
[null,null,null,null,null,"TNKB-2400x88","X 2400-88"]
[null,null,null,null,null,"TNKB-2400x100","X 2400-100"]
[null,null,null,null,null,"TNKB-2400x113","X 2400-113"]
[null,null,null,null,null,"TNKB-2400x125","X 2400-125"]
[null,null,null,null,null,"TNKB-2400x138","X 2400-138"]
[null,null,null,null,null,"TNKB-2400x150","X 2400-150"]
[null,null,null,null,null,"TNKB-4200x16","X 4200-16"]
[null,null,null,null,null,"TNKB-4200x25","X 4200-25"]
[null,null,null,null,null,"TNKB-4200x38","X 4200-38"]
[null,null,null,null,null,"TNKB-4200x50","X 4200-50"]
[null,null,null,null,null,"TNKB-4200x63","X 4200-63"]
[null,null,null,null,null,"TNKB-4200x75","X 4200-75"]
[null,null,null,null,null,"TNKB-4200x88","X 4200-88"]
[null,null,null,null,null,"TNKB-4200x100","X 4200-100"]
[null,null,null,null,null,"TNKB-4200x113","X 4200-113"]
[null,null,null,null,null,"TNKB-4200x125","X 4200-125"]
[null,null,null,null,null,"TNKB-4200x138","X 4200-138"]
[null,null,null,null,null,"TNKB-4200x150","X 4200-150"]
[null,null,null,null,null,"TNKB-4200x163","X 4200-163"]
[null,null,null,null,null,"TNKB-4200x175","X 4200-175"]
[null,null,null,null,null,"TNKB-6600x16","X 6600-16"]
[null,null,null,null,null,"TNKB-6600x25","X 6600-25"]
[null,null,null,null,null,"TNKB-6600x38","X 6600-38"]
[null,null,null,null,null,"TNKB-6600x50","X 6600-50"]
[null,null,null,null,null,"TNKB-6600x63","X 6600-63"]
[null,null,null,null,null,"TNKB-6600x75","X 6600-75"]
[null,null,null,null,null,"TNKB-6600x88","X 6600-88"]
[null,null,null,null,null,"TNKB-6600x100","X 6600-100"]
[null,null,null,null,null,"TNKB-6600x113","X 6600-113"]
[null,null,null,null,null,"TNKB-6600x125","X 6600-125"]
[null,null,null,null,null,"TNKB-6600x138","X 6600-138"]
[null,null,null,null,null,"TNKB-6600x150","X 6600-150"]
[null,null,null,null,null,"TNKB-6600x163","X 6600-163"]
[null,null,null,null,null,"TNKB-6600x175","X 6600-175"]
[null,null,null,null,null,"TNKB-6600x188","X 6600-188"]
[null,null,null,null,null,"TNKB-6600x200","X 6600-200"]
[null,null,null,null,null,"TNKT-1000x13","X 1000-13"]
[null,null,null,null,null,"TNKT-1000x16","X 1000-16"]
[null,null,null,null,null,"TNKT-1000x19","X 1000-19"]
[null,null,null,null,null,"TNKT-1000x25","X 1000-25"]
[null,null,null,null,null,"TNKT-1000x32","X 1000-32"]
[null,null,null,null,null,"TNKT-1000x38","X 1000-38"]
[null,null,null,null,null,"TNKT-1000x50","X 1000-50"]
[null,null,null,null,null,"TNKT-1000x63","X 1000-63"]
[null,null,null,null,null,"TNKT-1000x75","X 1000-75"]
[null,null,null,null,null,"TNKT-1000x80","X 1000-80"]
[null,null,null,null,null,"TNKT-1000x100","X 1000-100"]
[null,null,null,null,null,"TNKT-1000x125","X 1000-125"]
[null,null,null,null,null,"TNKT-1000x150","X 1000-150"]
[null,null,null,null,null,"TNKT-1000x175","X 1000-175"]
[null,null,null,null,null,"TNKT-1000x200","X 1000-200"]
[null,null,null,null,null,"TNKT-2400x16","X 2400-16"]
[null,null,null,null,null,"TNKT-2400x19","X 2400-19"]
[null,null,null,null,null,"TNKT-2400x25","X 2400-25"]
[null,null,null,null,null,"TNKT-2400x32","X 2400-32"]
[null,null,null,null,null,"TNKT-2400x38","X 2400-38"]
[null,null,null,null,null,"TNKT-2400x50","X 2400-50"]
[null,null,null,null,null,"TNKT-2400x63","X 2400-63"]
[null,null,null,null,null,"TNKT-2400x75","X 2400-75"]
[null,null,null,null,null,"TNKT-2400x80","X 2400-80"]
[null,null,null,null,null,"TNKT-2400x100","X 2400-100"]
[null,null,null,null,null,"TNKT-2400x125","X 2400-125"]
[null,null,null,null,null,"TNKT-2400x150","X 2400-150"]
[null,null,null,null,null,"TNKT-2400x175","X 2400-175"]
[null,null,null,null,null,"TNKT-2400x200","X 2400-200"]
[null,null,null,null,null,"TNKT-4200x16","X 4200-16"]
[null,null,null,null,null,"TNKT-4200x19","X 4200-19"]
[null,null,null,null,null,"TNKT-4200x25","X 4200-25"]
[null,null,null,null,null,"TNKT-4200x32","X 4200-32"]
[null,null,null,null,null,"TNKT-4200x38","X 4200-38"]
[null,null,null,null,null,"TNKT-4200x50","X 4200-50"]
[null,null,null,null,null,"TNKT-4200x63","X 4200-63"]
[null,null,null,null,null,"TNKT-4200x75","X 4200-75"]
[null,null,null,null,null,"TNKT-4200x80","X 4200-80"]
[null,null,null,null,null,"TNKT-4200x100","X 4200-100"]
[null,null,null,null,null,"TNKT-4200x125","X 4200-125"]
[null,null,null,null,null,"TNKT-4200x150","X 4200-150"]
[null,null,null,null,null,"TNKT-4200x175","X 4200-175"]
[null,null,null,null,null,"TNKT-4200x200","X 4200-200"]
[null,null,null,null,null,"TNKT-4200x225","X 4200-225"]
[null,null,null,null,null,"TNKT-6600x16","X 6600-16"]
[null,null,null,null,null,"TNKT-6600x19","X 6600-19"]
[null,null,null,null,null,"TNKT-6600x25","X 6600-25"]
[null,null,null,null,null,"TNKT-6600x32","X 6600-32"]
[null,null,null,null,null,"TNKT-6600x38","X 6600-38"]
[null,null,null,null,null,"TNKT-6600x50","X 6600-50"]
[null,null,null,null,null,"TNKT-6600x63","X 6600-63"]
[null,null,null,null,null,"TNKT-6600x75","X 6600-75"]
[null,null,null,null,null,"TNKT-6600x80","X 6600-80"]
[null,null,null,null,null,"TNKT-6600x100","X 6600-100"]
[null,null,null,null,null,"TNKT-6600x125","X 6600-125"]
[null,null,null,null,null,"TNKT-6600x150","X 6600-150"]
[null,null,null,null,null,"TNKT-6600x175","X 6600-175"]
[null,null,null,null,null,"TNKT-6600x200","X 6600-200"]
[null,null,null,null,null,"TNKT-6600x225","X 6600-225"]
[null,null,null,null,null,"TNKS-1000x13","X 1000-13"]
[null,null,null,null,null,"TNKS-1000x16","X 1000-16"]
[null,null,null,null,null,"TNKS-1000x19","X 1000-19"]
[null,null,null,null,null,"TNKS-1000x25","X 1000-25"]
[null,null,null,null,null,"TNKS-1000x32","X 1000-32"]
[null,null,null,null,null,"TNKS-1000x38","X 1000-38"]
[null,null,null,null,null,"TNKS-1000x50","X 1000-50"]
[null,null,null,null,null,"TNKS-1000x63","X 1000-63"]
[null,null,null,null,null,"TNKS-1000x75","X 1000-75"]
[null,null,null,null,null,"TNKS-1000x80","X 1000-80"]
[null,null,null,null,null,"TNKS-1000x100","X 1000-100"]
[null,null,null,null,null,"TNKS-1000x125","X 1000-125"]
[null,null,null,null,null,"TNKS-1000x150","X 1000-150"]
[null,null,null,null,null,"TNKS-1000x175","X 1000-175"]
[null,null,null,null,null,"TNKS-1000x200","X 1000-200"]
[null,null,null,null,null,"TNKS-2400x16","X 2400-16"]
[null,null,null,null,null,"TNKS-2400x19","X 2400-19"]
[null,null,null,null,null,"TNKS-2400x25","X 2400-25"]
[null,null,null,null,null,"TNKS-2400x32","X 2400-32"]
[null,null,null,null,null,"TNKS-2400x38","X 2400-38"]
[null,null,null,null,null,"TNKS-2400x50","X 2400-50"]
[null,null,null,null,null,"TNKS-2400x63","X 2400-63"]
[null,null,null,null,null,"TNKS-2400x75","X 2400-75"]
[null,null,null,null,null,"TNKS-2400x80","X 2400-80"]
[null,null,null,null,null,"TNKS-2400x100","X 2400-100"]
[null,null,null,null,null,"TNKS-2400x125","X 2400-125"]
[null,null,null,null,null,"TNKS-2400x150","X 2400-150"]
[null,null,null,null,null,"TNKS-2400x175","X 2400-175"]
[null,null,null,null,null,"TNKS-2400x200","X 2400-200"]
[null,null,null,null,null,"TNKS-4200x16","X 4200-16"]
[null,null,null,null,null,"TNKS-4200x19","X 4200-19"]
[null,null,null,null,null,"TNKS-4200x25","X 4200-25"]
[null,null,null,null,null,"TNKS-4200x32","X 4200-32"]
[null,null,null,null,null,"TNKS-4200x38","X 4200-38"]
[null,null,null,null,null,"TNKS-4200x50","X 4200-50"]
[null,null,null,null,null,"TNKS-4200x63","X 4200-63"]
[null,null,null,null,null,"TNKS-4200x75","X 4200-75"]
[null,null,null,null,null,"TNKS-4200x80","X 4200-80"]
[null,null,null,null,null,"TNKS-4200x100","X 4200-100"]
[null,null,null,null,null,"TNKS-4200x125","X 4200-125"]
[null,null,null,null,null,"TNKS-4200x150","X 4200-150"]
[null,null,null,null,null,"TNKS-4200x175","X 4200-175"]
[null,null,null,null,null,"TNKS-4200x200","X 4200-200"]
[null,null,null,null,null,"TNKS-4200x225","X 4200-225"]
[null,null,null,null,null,"TNKS-6600x16","X 6600-16"]
[null,null,null,null,null,"TNKS-6600x19","X 6600-19"]
[null,null,null,null,null,"TNKS-6600x25","X 6600-25"]
[null,null,null,null,null,"TNKS-6600x32","X 6600-32"]
[null,null,null,null,null,"TNKS-6600x38","X 6600-38"]
[null,null,null,null,null,"TNKS-6600x50","X 6600-50"]
[null,null,null,null,null,"TNKS-6600x63","X 6600-63"]
[null,null,null,null,null,"TNKS-6600x75","X 6600-75"]
[null,null,null,null,null,"TNKS-6600x80","X 6600-80"]
[null,null,null,null,null,"TNKS-6600x100","X 6600-100"]
[null,null,null,null,null,"TNKS-6600x125","X 6600-125"]
[null,null,null,null,null,"TNKS-6600x150","X 6600-150"]
[null,null,null,null,null,"TNKS-6600x175","X 6600-175"]
[null,null,null,null,null,"TNKS-6600x200","X 6600-200"]
[null,null,null,null,null,"TNKS-6600x225","X 6600-225"]
[null,null,null,null,null,"TNK-400x0.25","TU 500-10"]
[null,null,null,null,null,"TNK-400x0.5","TU 500-12.7"]
[null,null,null,null,null,"TNK-400x0.75","TU 500-12.7"]
[null,null,null,null,null,"TNK-400x1","TU 500-25"]
[null,null,null,null,null,"TNK-400x1.5","TU 500-38.1"]
[null,null,null,null,null,"TNK-400x2","TU 500-50"]
[null,null,null,null,null,"TNK-400x2.5","TU 500-63.5"]
[null,null,null,null,null,"TNK-400x3","TU 500-80"]
[null,null,null,null,null,"TNK-400x0.25 HS","TU 500-10"]
[null,null,null,null,null,"TNK-400x0.5 HS","TU 500-12.7"]
[null,null,null,null,null,"TNK-400x0.75 HS","TU 500-12.7"]
[null,null,null,null,null,"TNK-400x1 HS","TU 500-25"]