{"text_format":"1","workbook":"xlsx","n_sheets":11,"sheets":["Calculator","Hyson","Ford","GM","FCA","Kaller","Unit conv","Fjäderkurva","Tempdatabladet","KallerTemp","Hyson-Kaller conv"],"not_rendered":{"charts":2,"images":8,"macros":1,"external_links":1,"defined_names":77,"comments":0,"pivot_tables":0},"unopened":[],"bounds":{"document_bytes":16777216,"sheet_cells":100000,"rows_first":2000,"rows_last":500,"rows_between":2000,"halvings":0,"cell_chars":16384,"cell_head_chars":4096},"cells_cut":0,"cells_raw":0,"read":"whole","date_system":"1900"}

{"sheet":"Calculator","index":0,"n_rows":60,"n_cols":34,"rows_kept":60,"cut":false,"hidden":false,"merged":[]}
[null,"Indexval från listor. Input till kod",null,null,null,"Lbox 6","LBox 7","LBox 8",null,null,"Vald produkt",null,null,"Fi","Fs","Fylltryck","Hyson Part nr","Slag"]
[null,"val1","val2","val3",null,"T2L",50,"7 mm",null,null,"T2",50,"7 mm",500,597,180,"T2-50x7",7]
[null,6,1,1,null,"NP",70,"10 mm",null,null,"Kolumn 7 Ska vara StrCode",null,null,"Temperature refecence","Vald produkt"]
[null,null,null,null,null,"T3",90,"12.7 mm",null,null,"T2-50x7",null,null,{"$f":"VLOOKUP(L6,'Hyson-Kaller conv'!C2:D164,2,0)","v":"R12"},"T2-50x7"]
[null,"Lbox 9 Varumärke",null,null,null,"T4",180,"15 mm",null,null,null,{"$f":"FIND(\"x\",K4)","v":6}]
[null,"HYSON",1,"Index",null,"NPL",200,"19 mm",null,null,null,{"$f":"IFERROR(LEFT(K4,L5-1),K4)","v":"T2-50"}]
[null,"FORD",null,null,null,"T2","750P","25 mm"]
[null,"GM",null,null,null,"T3T",null,"38 mm"]
[null,"FCA",null,null,null,"T3F",null,"50 mm",null,null,"Hämtat från temperaturbladet"]
[null,"KALLER",null,null,null,"T4SC",null,"63 mm",null,null,{"$f":"VLOOKUP($N$4,Tempdatabladet!$A$1:$AD$167,16,0)","v":20.774325052322496},null,null,{"$f":"IF(ISERROR(K10),\"Temperature data not available\",\"\")","v":""}]
[null,null,null,null,null,"T5",null,"75 mm",null,null,{"$f":"IF(ISERROR(K12),\"No data\",ROUND(K12,0))","v":21},"om no data",null,"Felmeddelande om tempdata saknas"]
[null,null,null,null,null,"TNKT",null,"80 mm",null,null,{"$f":"'Unit conv'!D66","v":20.774325052322496},"C° eller F°"]
[null,null,null,null,null,"TNKS",null,"100 mm",null,null,null,null,null,null,null,null,null,null,null,null,{"$f":"CONCATENATE(\"Chosen Spring: \",O4)","v":"Chosen Spring: T2-50x7"},null,null,null,null,{"$f":"CONCATENATE(\"HYSON Part Number: \",Q2)","v":"HYSON Part Number: T2-50x7"}]
[null,null,null,null,null,"TNK",null,"125 mm"]
[null,null,null,null,null,"T2B",null,null,null,null,{"$f":"VLOOKUP($N$4,Tempdatabladet!$A$1:$AD$167,17,0)","v":30.774325052322496}]
{"$rows_left_out":46}
{"sheet":"Hyson","index":1,"n_rows":1064,"n_cols":12,"rows_kept":1064,"cut":false,"hidden":false,"merged":[]}
[null,null,null,"Family","Size","Stroke","Init Force","Final Force","Max Pres","Str code","mm",{"$f":"J1","v":"Str code"}]
[null,null,null,"T2L",300,"0.25 in",2650,3500,150,"T2L-300x0.25",6.35,{"$f":"J2","v":"T2L-300x0.25"}]
[null,null,null,"T2L",300,"10 mm",2650,3500,150,"T2L-300x10",10,"T2L-300x10"]
[null,null,null,"T2L",300,"0.50 in",2650,3500,150,"T2L-300x0.50",12.7,"T2L-300x0.50"]
[null,null,null,"T2L",300,"16 mm",2650,3500,150,"T2L-300x16",16,"T2L-300x16"]
[null,null,null,"T2L",300,"0.75 in",2650,3500,150,"T2L-300x0.75",19.049999999999997,"T2L-300x0.75"]
[null,null,null,"T2L",300,"25 mm",2650,3500,150,"T2L-300x25",25,"T2L-300x25"]
[null,null,null,"T2L",300,"1.00 in",2650,3500,150,"T2L-300x1.00",25.4,"T2L-300x1.00"]
[null,null,null,"T2L",300,"1.50 in",2650,3500,150,"T2L-300x1.50",38.099999999999994,"T2L-300x1.50"]
[null,null,null,"T2L",300,"50 mm",2650,3500,150,"T2L-300x50",50,"T2L-300x50"]
[null,null,null,"T2L",300,"2.00 in",2650,3500,150,"T2L-300x2.00",50.8,"T2L-300x2.00"]
[null,null,null,"T2L",300,"2.50 in",2650,3500,150,"T2L-300x2.50",63.5,"T2L-300x2.50"]
[null,null,null,"T2L",300,"3.00 in",2650,3500,150,"T2L-300x3.00",76.199999999999989,"T2L-300x3.00"]
[null,null,null,"T2L",300,"80 mm",2650,3500,150,"T2L-300x80",80,"T2L-300x80"]
[null,null,null,"T2L",300,"3.50 in",2650,3500,150,"T2L-300x3.50",88.899999999999991,"T2L-300x3.50"]
{"$rows_left_out":1050}
{"sheet":"Ford","index":2,"n_rows":131,"n_cols":12,"rows_kept":131,"cut":false,"hidden":false,"merged":[]}
[null,null,null,"Ford Series","Ford Size","Stroke","Init Force","Final Force","Max Pres","Hyson Reference","mm","Ford STRCode"]
[null,null,null,"WDX356015",7,"25 mm",106000,160000,150,"NP-750x25",25,"WDX356015-07-02-DMS"]
[null,null,null,"WDX356015",7,"38.1 mm",106000,160000,150,"NP-750x38.1",38.1,"WDX356015-07-03-DMS"]
[null,null,null,"WDX356015",7,"50 mm",106000,160000,150,"NP-750x50",50,"WDX356015-07-05-DMS"]
[null,null,null,"WDX356015",7,"63.5 mm",106000,160000,150,"NP-750x63.5",63.5,"WDX356015-07-06-DMS"]
[null,null,null,"WDX356015",7,"80 mm",106000,160000,150,"NP-750x80",80,"WDX356015-07-08-DMS"]
[null,null,null,"WDX356015",7,"100 mm",106000,160000,150,"NP-750x100",100,"WDX356015-07-10-DMS"]
[null,null,null,"WDX356015",7,"125 mm",106000,160000,150,"NP-750x125",125,"WDX356015-07-12-DMS"]
[null,null,null,"WDX356015",7,"160 mm",106000,160000,150,"NP-750x160",160,"WDX356015-07-16-DMS"]
[null,null,null,"WDX356015",7,"200 mm",106000,160000,150,"NP-750x200",200,"WDX356015-07-20-DMS"]
[null,null,null,"WDX356015",15,"25 mm",106000,160000,150,"NP-1500x25",25,"WDX356015-15-02-DMS"]
[null,null,null,"WDX356015",15,"38.1 mm",106000,160000,150,"NP-1500x38.1",38.1,"WDX356015-15-03-DMS"]
[null,null,null,"WDX356015",15,"50 mm",106000,160000,150,"NP-1500x50",50,"WDX356015-15-05-DMS"]
[null,null,null,"WDX356015",15,"63.5 mm",106000,160000,150,"NP-1500x63.5",63.5,"WDX356015-15-06-DMS"]
[null,null,null,"WDX356015",15,"80 mm",106000,160000,150,"NP-1500x80",80,"WDX356015-15-08-DMS"]
{"$rows_left_out":117}
{"sheet":"GM","index":3,"n_rows":192,"n_cols":12,"rows_kept":192,"cut":false,"hidden":false,"merged":[]}
[null,null,null,"GM Series","GM Size","Stroke","Init Force","Final Force","Max Pres","Hyson Reference","mm","GM STRCode"]
[null,null,null,"90.25.00",2.5,"10 mm",2000,3060,180,"T2L-300x10",10,"90.25.00-2.5-10"]
[null,null,null,"90.25.00",2.5,"16 mm",2000,3060,180,"T2L-300x16",16,"90.25.00-2.5-16"]
[null,null,null,"90.25.00",2.5,"25 mm",2000,3060,180,"T2L-300x25",25,"90.25.00-2.5-25"]
[null,null,null,"90.25.00",2.5,"50 mm",2000,3060,180,"T2L-300x50",50,"90.25.00-2.5-50"]
[null,null,null,"90.25.00",2.5,"80 mm",2000,3060,180,"T2L-300x80",80,"90.25.00-2.5-80"]
[null,null,null,"90.25.00",2.5,"100 mm",2000,3060,180,"T2L-300x100",100,"90.25.00-2.5-100"]
[null,null,null,"90.25.00",2.5,"125 mm",2000,3060,180,"T2L-300x125",125,"90.25.00-2.5-125"]
[null,null,null,"90.25.00",5,"10 mm",106000,160000,150,"NP-500x10",10,"90.25.00-5-10"]
[null,null,null,"90.25.00",5,"25 mm",106000,160000,150,"NP-500x25",25,"90.25.00-5-25"]
[null,null,null,"90.25.00",5,"50 mm",106000,160000,150,"NP-500x50",50,"90.25.00-5-50"]
[null,null,null,"90.25.00",5,"80 mm",106000,160000,150,"NP-500x80",80,"90.25.00-5-80"]
[null,null,null,"90.25.00",5,"100 mm",106000,160000,150,"NP-500x100",100,"90.25.00-5-100"]
[null,null,null,"90.25.00",5,"125 mm",106000,160000,150,"NP-500x125",125,"90.25.00-5-125"]
[null,null,null,"90.25.00",5,"160 mm",106000,160000,150,"NP-500x160",160,"90.25.00-5-160"]
{"$rows_left_out":178}
{"sheet":"FCA","index":4,"n_rows":251,"n_cols":12,"rows_kept":251,"cut":false,"hidden":false,"merged":[]}
[null,null,null,"FCA Series","FCA Size","Stroke","Init Force","Final Force","Max Pres","Hyson Reference","mm","FCA STRCode"]
[null,null,null,"39-670-1","2 kN","15 mm",106000,160000,150,"T2-180x15",15,"39-670-1851"]
[null,null,null,"39-670-1","2 kN","25 mm",106000,160000,150,"T2-180x25",25,"39-670-1852"]
[null,null,null,"39-670-1","2 kN","38.1 mm",106000,160000,150,"T2-180x38.1",38.1,"39-670-1853"]
[null,null,null,"39-670-1","2 kN","50 mm",106000,160000,150,"T2-180x50",50,"39-670-1855"]
[null,null,null,"39-670-1","2 kN","63.5 mm",106000,160000,150,"T2-180x63.5",63.5,"39-670-1856"]
[null,null,null,"39-670-1","2 kN","80 mm",106000,160000,150,"T2-180x80",80,"39-670-1858"]
[null,null,null,"39-670-1","2 kN","100 mm",106000,160000,150,"T2-180x100",100,"39-670-1875"]
[null,null,null,"39-670-1","2 kN","125 mm",106000,160000,150,"T2-180x125",125,"39-670-1885"]
[null,null,null,"39-670-6",".9 kN","15 mm",2000,3060,180,"T2-90x15",15,"39-670-6715"]
[null,null,null,"39-670-6",".9 kN","25 mm",2000,3060,180,"T2-90x25",25,"39-670-6725"]
[null,null,null,"39-670-6",".9 kN","38.1 mm",2000,3060,180,"T2-90x38.1",38.1,"39-670-6738"]
[null,null,null,"39-670-6",".9 kN","50 mm",2000,3060,180,"T2-90x50",50,"39-670-6750"]
[null,null,null,"39-670-6",".9 kN","63.5 mm",2000,3060,180,"T2-90x63.5",63.5,"39-670-6760"]
[null,null,null,"39-670-6",".9 kN","80 mm",2000,3060,180,"T2-90x80",80,"39-670-6780"]
{"$rows_left_out":237}
{"sheet":"Kaller","index":5,"n_rows":732,"n_cols":15,"rows_kept":732,"cut":false,"hidden":true,"merged":[]}
[null,null,null,"Family","Size","Stroke","Init Force","Final Force","Max Pres","Hyson Reference","mm","Kaller Str Code",null,"Unit","Number with dot"]
[null,null,null,"TU",250,"10 mm",2000,3060,180,"T2L-300x10",{"$f":"IF(N2=\"mm\",O2,O2*25.4)","v":10},"TU 250-10",null,{"$f":"RIGHT(F2,2)","v":"mm"},{"$f":"VALUE(SUBSTITUTE(LEFT(F2,SEARCH(\" \",F2)-1),\".\",\",\"))","v":10}]
[null,null,null,"TU",250,"0.50 in",2000,3060,180,"T2L-300x0.50",12.7,"TU 250-12,7",null,"in",0.5]
[null,null,null,"TU",250,"16 mm",2000,3060,180,"T2L-300x16",16,"TU 250-16",null,"mm",16]
[null,null,null,"TU",250,"25 mm",2000,3060,180,"T2L-300x25",25,"TU 250-25",null,"mm",25]
[null,null,null,"TU",250,"1.50 in",2000,3060,180,"T2L-300x1.50",38.099999999999994,"TU 250-38,1",null,"in",1.5]
[null,null,null,"TU",250,"50 mm",2000,3060,180,"T2L-300x50",50,"TU 250-50",null,"mm",50]
[null,null,null,"TU",250,"2.50 in",2000,3060,180,"T2L-300x2.50",63.5,"TU 250-63,5",null,"in",2.5]
[null,null,null,"TU",250,"80 mm",2000,3060,180,"T2L-300x80",80,"TU 250-80",null,"mm",80]
[null,null,null,"TU",250,"100 mm",2000,3060,180,"T2L-300x100",100,"TU 250-100",null,"mm",100]
[null,null,null,"TU",250,"125 mm",2000,3060,180,"T2L-300x125",125,"TU 250-125",null,"mm",125]
[null,null,null,"TU",500,"10 mm",106000,160000,150,"NP-500x10",10,"TU 500-10",null,"mm",10]
[null,null,null,"TU",500,"12.7 mm",106000,160000,150,"NP-500x12.7",12.7,"TU 500-12,7",null,"mm",12.7]
[null,null,null,"TU",500,"25 mm",106000,160000,150,"NP-500x25",25,"TU 500-25",null,"mm",25]
[null,null,null,"TU",500,"38.1 mm",106000,160000,150,"NP-500x38.1",38.1,"TU 500-38,1",null,"mm",38.1]
{"$rows_left_out":718}
{"sheet":"Unit conv","index":6,"n_rows":84,"n_cols":5,"rows_kept":84,"cut":false,"hidden":true,"merged":[]}
[]
[]
[]
[]
[null,"Units","Metric  (bar, kN, mm, °C)"]
[null,null,"Imperial  (psi, lbf, inch, °F)"]
[]
[null,null,1,1]
[]
[]
[]
["Unit convertion"]
[]
[]
[null,null,"Pressure"]
{"$rows_left_out":70}
{"sheet":"Fjäderkurva","index":7,"n_rows":68,"n_cols":20,"rows_kept":68,"cut":false,"hidden":true,"merged":[]}
[]
[]
[]
[]
[]
[null,null,"Vi/Vf = (Ff/Fi)^(1/1,4)"]
[null,null,"Isotermt är Vi/Vf=(Ff/Fi)",null,null,null,null,null,null,"Virtuell slagvolym",null,null,"Vi / Vf","(Vi / Vf)^kappa","Iso t kraft per fj","Diagramförklaring","Diagramförklaring",null,"Diagramförklaring","Diagramförklaring"]
[null,null,null,null,null,null,null,null,null,null,null,null,null,null,"kN eller lbf",{"$f":"IF(Used_Temperature_Unit=\"°C\",\"Isothermal force at 20 °C\",\"Isothermal force at 68 °F\")","v":"Isothermal force at 20 °C"},{"$f":"\"Isothermal force at running temperature\"","v":"Isothermal force at running temperature"},null,{"$f":"IF(Used_Temperature_Unit=\"°C\",\"Polytropic force at 20 °C\",\"Polytropic force at 68 °F\")","v":"Polytropic force at 20 °C"},{"$f":"\"Polytropic force at running temperature\"","v":"Polytropic force at running temperature"}]
[null,null,null,null,null,null,null,null,null,"Kurva"]
[null,null,null,null,null,null,null,null,null,"Part_Of_Stroke","Stroke_Vector_mm","Virtual_Volume_Vector","Volume_Ratio_Vector","Pressure_Factor_Vector","Isothermal_Force_Vector","Total_Isothermal_Force_Vector_20C","Total_Isothermal_Force_Vector_RunningT","Polytropic_Force_Vector","Total_Polytropic_Force_Vector_20C","Total_Polytropic_Force_Vector_RunningT"]
[null,null,null,null,null,null,null,null,null,0,{"$f":"Part_Of_Stroke_Vector*Used_stroke_for_calculation","v":0},{"$f":"Virtual_Volume-Stroke_Vector_mm","v":43.082474226804138},{"$f":"Virtual_Volume/Virtual_Volume_Vector","v":1},{"$f":"Volume_Ratio_Vector^Kappa","v":1},{"$f":"Initial_Force*Volume_Ratio_Vector","v":0.41666666666666669},{"$f":"Isothermal_Force_Vector*User_Number_of_cylinders","v":0.41666666666666669},{"$f":"Total_Isothermal_Force_Vector_20C*Temperature_Factor","v":0.42487816418134605},{"$f":"Initial_Force*Pressure_Factor_Vector","v":0.41666666666666669},{"$f":"User_Number_of_cylinders*Polytropic_Force_Vector","v":0.41666666666666669},{"$f":"Total_Polytropic_Force_Vector_20C*Temperature_Factor","v":0.42487816418134605}]
[null,null,"Used_Stroke_length_in_mm",{"$f":"IF(Length_unit=1,User_Used_Stroke,User_Used_Stroke/Convertion_factor_length)","v":5},"mm","Omräknat till mm om tum är valt",null,null,null,0.1,0.5,42.582474226804138,1.0117419198644233,1.0164772019265593,0.42155913327684308,0.42155913327684308,0.4298670495373067,0.42353216746939976,0.42353216746939976,0.43187896748674792]
[null,null,"Product_Stroke_length_in_chosen_Unit",{"$f":"FLOOR(IF(Length_unit=1,Product_stroke_length_mm,Product_stroke_length_mm*Convertion_factor_length),0.001)","v":7},"mm or inch",null,null,null,null,0.2,1,42.082474226804138,1.0237628613424792,1.0334253701144465,0.42656785889269966,0.42656785889269966,0.43497448508423447,0.43059390421435273,0.43059390421435273,0.43907987407265409]
[null,null,"Used stroke for calculation",{"$f":"IF(Used_Stroke_length_in_mm>Product_stroke_length_mm,Product_stroke_length_mm,Used_Stroke_length_in_mm)","v":5},"mm","Om utnyttjad slagl är större än max sätts max",null,null,null,0.3,1.5,41.582474226804138,1.0360728895500186,1.0508638049053174,0.4316970373125078,0.4316970373125078,0.44020474727007447,0.43785991871054891,0.43785991871054891,0.44648908423279543]
[null,null,null,null,null,null,null,null,null,0.4,2,41.082474226804138,1.0486825595984943,1.0688128426847541,0.43695106649937265,0.43695106649937265,0.44556232073120328,0.44533868445198088,0.44533868445198088,0.45411523845334412]
{"$rows_left_out":54}
{"sheet":"Tempdatabladet","index":8,"n_rows":167,"n_cols":41,"rows_kept":167,"cut":false,"hidden":false,"merged":[]}
["Nya kolumner",null,"Gröna kolumner visas i databladet"]
[]
[null,null,null,null,null,"Kolumn F"]
[null,null,null,null,null,"Tagit bort listboxarna/MC"]
[]
[null,null,null,null,null,null,null,null,null,null,null,null,null,null,null,null,null,null,null,null,null,null,null,null,null,null,null,null,null,null,null,null,"Införs i steg"]
[null,null,"T4SC-","CU4",null,"Strokelength","Utilized","Fill pressure","Frequency","Env./Tool","Env./Tool","Env./Tool",null,null,null,"Estimated running",null,{"$f":"P7","v":"Estimated running"},null,null,null,"F° env./tool",null,null,null,null,null,{"$f":"P7","v":"Estimated running"},null,null,null,null,1]
[null,null,null,null,null,null,"strokelength",null,null,"temperature","temperature","temperature","Rörlängd","Röryta","Fjäderfaktor","temperature between:",null,"temperature between:",null,null,null,"temp.",null,null,null,null,null,{"$f":"P8","v":"temperature between:"},null,null,null,null,1]
[null,null,"Spring Size","Spring Size",null,null,"[mm]","[Bar]","[spm]","[°C]","[°F]","[°C]","L (approx)","A","Kf","[°C]","[°C]","[°C]","[°C]","P som [°F]","Q som [°F]","to C°","N + T","U + 10°C","U to F°","V to F°","[°F]","[°F]","[°C]","[°C]",null,null,1]
[{"$f":"CONCATENATE(\"CU4\",\" \",D10)","v":"CU4 420"},null,420,420,null,{"$f":"Product_stroke_length_mm","v":7},{"$f":"Used_stroke_for_calculation","v":5},{"$f":"Filling_Pressure_in_bar","v":150},{"$f":"User_SPM","v":20},{"$f":"Surrounding_temperature_in_C°","v":20},77,{"$f":"5/9*(K10-32)","v":25},{"$f":"39.1+2.146*F10","v":54.122},{"$f":"24.9*PI()*M10*0.01","v":42.337290121799107},{"$f":"0.49+0.017*F10-0.00037*F10^2","v":0.59087000000000001},{"$f":"G10*H10*I10*(G10/F10)^1.1/(150*N10*O10)+J10","v":22.760858595751426},{"$f":"P10+10","v":32.760858595751429},22.760858595751426,32.760858595751429,{"$f":"9/5*R10+32","v":72.969545472352564},{"$f":"9/5*S10+32","v":90.969545472352564},{"$f":"5/9*(K10-32)","v":25},{"$f":"P10+V10","v":47.760858595751429},{"$f":"W10+10","v":57.760858595751429},{"$f":"9/5*W10+32","v":117.96954547235258},{"$f":"9/5*X10+32","v":135.96954547235259},{"$f":"Y10","v":117.96954547235258},135.96954547235259,{"$f":"5/9*(AA10-32)","v":47.760858595751436},{"$f":"5/9*(AB10-32)","v":57.760858595751444},{"$f":"IF(Q10>80,\"High temp. Please contact your distributor for advice\",IF(H10>150,\"Too high charging pressure!\",\"\"))","v":""},{"$f":"AE10","v":""},1,"Samma som CU",null,null,null,null,null,33,43]
[{"$f":"CONCATENATE(\"CU4\",\" \",D11)","v":"CU4 740"},null,740,740,null,7,5,150,20,20,77,{"$f":"5/9*(K11-32)","v":25},{"$f":"45+2*F11","v":59},{"$f":"32*PI()*M11*0.01","v":59.313269299775293},{"$f":"2.5-0.039*F11","v":2.2269999999999999},{"$f":"G11*H11*I11*(G11/F11)^1.1/(150*N11*O11)+J11","v":20.522862001532232},30.522862001532232,20.522862001532232,30.522862001532232,{"$f":"9/5*R11+32","v":68.941151602758026},86.941151602758026,{"$f":"5/9*(K11-32)","v":25},{"$f":"P11+V11","v":45.522862001532232},{"$f":"W11+10","v":55.522862001532232},{"$f":"9/5*W11+32","v":113.94115160275803},131.94115160275803,113.94115160275803,131.94115160275803,{"$f":"5/9*(AA11-32)","v":45.522862001532239},55.522862001532239,"",{"$f":"AE11","v":""},1,"Samma som CU",null,null,null,null,null,30,40]
["CU4 1000",null,1000,1000,null,7,5,150,20,20,77,25,{"$f":"38.9+2.88*F12","v":59.06},{"$f":"37.9*PI()*M12*0.01","v":70.320593143863988},{"$f":"0.8248-0.002*F12","v":0.81079999999999997},21.211331177813268,31.211331177813268,21.211331177813268,31.211331177813268,70.180396120063875,88.180396120063875,25,46.211331177813264,56.211331177813264,115.18039612006388,133.18039612006388,115.18039612006388,133.18039612006388,46.211331177813264,56.211331177813264,"","",1,"Samma som CU",null,null,null,null,null,28,38]
["CU4 1800",null,1800,1800,null,7,5,150,20,20,77,25,{"$f":"46.6+2.535*F13","v":64.344999999999999},{"$f":"50.2*PI()*M13*0.01","v":101.4771812062081},{"$f":"0.8713-0.0118*F13","v":0.78869999999999996},20.862936670790027,30.862936670790027,20.862936670790027,30.862936670790027,69.553286007422059,87.553286007422059,25,45.862936670790027,55.862936670790027,114.55328600742205,132.55328600742206,114.55328600742205,132.55328600742206,45.862936670790027,55.862936670790035,"","",1,"Samma som CU + slagl. 65",null,null,null,null,null,30,40]
["CU4 2900",null,2900,2900,null,7,5,150,20,20,77,25,{"$f":"55+2*F14","v":69},{"$f":"63.2*PI()*M14*0.01","v":136.99857243774372},{"$f":"1.2-0.0181*F14","v":1.0732999999999999},20.469701546037577,30.469701546037577,20.469701546037577,30.469701546037577,68.845462782867642,86.845462782867642,25,45.469701546037577,55.469701546037577,113.84546278286764,131.84546278286763,113.84546278286764,131.84546278286763,45.469701546037584,55.469701546037577,"","",1,"Samma som CU + slagl. 65",null,null,null,null,null,29,39]
["CU4 4700",null,4700,4700,null,7,5,150,20,20,77,25,{"$f":"40+3*F15","v":61},{"$f":"75.2*PI()*M15*0.01","v":144.11113820547101},0.43,21.114533577231278,31.114533577231278,21.114533577231278,31.114533577231278,70.006160439016298,88.006160439016298,25,46.114533577231278,56.114533577231278,115.0061604390163,133.0061604390163,115.0061604390163,133.0061604390163,46.114533577231278,56.114533577231278,"","",1,"Samma som CU + slagl. 65",null,null,null,null,null,27,37]
{"$rows_left_out":153}
{"sheet":"KallerTemp","index":9,"n_rows":863,"n_cols":14,"rows_kept":863,"cut":false,"hidden":true,"merged":[]}
["Detta är värden ur katalog/MC",null,null,"Serie","Modell","Slagl","Fi","Fs","Tryck","StrCode"]
[null,null,null,"TU",250,10,2650,3500,150,"TU 250-10"]
[null,null,null,"TU",250,12.7,2650,3500,150,"TU 250-12,7"]
[null,null,null,"TU",250,16,2650,3500,150,"TU 250-16",null,null,"Not:"]
[null,null,null,"TU",250,25,2650,3500,150,"TU 250-25",null,null,"2017-01-11","CU4, CX, K, LCF, XG, R12, R15, TL, TUS, TUR inlagda"]
[null,null,null,"TU",250,38.1,2650,3500,150,"TU 250-38,1"]
[null,null,null,"TU",250,50,2650,3500,150,"TU 250-50"]
[null,null,null,"TU",250,63.5,2650,3500,150,"TU 250-63,5"]
[null,null,null,"TU",250,80,2650,3500,150,"TU 250-80"]
[null,null,null,"TU",250,100,2650,3500,150,"TU 250-100"]
[null,null,null,"TU",250,125,2650,3500,150,"TU 250-125"]
[null,null,null,"TU",500,10,4700,6000,150,"TU 500-10"]
[null,null,null,"TU",500,12.7,4700,6100,150,"TU 500-12,7"]
[null,null,null,"TU",500,25,4700,6400,150,"TU 500-25"]
[null,null,null,"TU",500,38.1,4700,6500,150,"TU 500-38,1"]
{"$rows_left_out":849}
{"sheet":"Hyson-Kaller conv","index":10,"n_rows":916,"n_cols":7,"rows_kept":916,"cut":false,"hidden":false,"merged":[]}
[null,null,"Hyson Reference","Kaller Str Code",null,"Hyson Reference","Kaller Str Code"]
[null,null,"T2L-300","TU 250",null,"T2L-300x10","TU 250-10"]
[null,null,"NP-500","TU 500",null,"T2L-300x0.50","TU 250-12,7"]
[null,null,"NP-750","TU 750",null,"T2L-300x16","TU 250-16"]
[null,null,"NP-1500","TU 1500",null,"T2L-300x25","TU 250-25"]
[null,null,"NP-3000","TU 3000",null,"T2L-300x1.50","TU 250-38,1"]
[null,null,"NP-5000","TU 5000",null,"T2L-300x50","TU 250-50"]
[null,null,"NP-7500","TU 7500",null,"T2L-300x2.50","TU 250-63,5"]
[null,null,"NP-10000","TU 10000",null,"T2L-300x80","TU 250-80"]
[null,null,"T2L-500","K 500",null,"T2L-300x100","TU 250-100"]
[null,null,"T2L-750","K 750",null,"T2L-300x125","TU 250-125"]
[null,null,"T3-170","X 170",null,"NP-500x10","TU 500-10"]
[null,null,"T3-320","X 320",null,"NP-500x12.7","TU 500-12,7"]
[null,null,"T3-350","X 350",null,"NP-500x25","TU 500-25"]
[null,null,"T3-500","X 500",null,"NP-500x38.1","TU 500-38,1"]
{"$rows_left_out":901}